ACCESSION: MSBNK-Fac_Eng_Univ_Tokyo-JP009344
RECORD_TITLE: HEXANE; EI-B; MS
DATE: 2016.01.19 (Created 2008.10.21, modified 2011.05.06)
AUTHORS: YAMAMOTO M, DEP. CHEMISTRY, FAC. SCIENCE, NARA WOMEN'S UNIV.
LICENSE: CC BY-NC-SA

CH$NAME: HEXANE
CH$COMPOUND_CLASS: N/A
CH$FORMULA: C6H14
CH$EXACT_MASS: 86.10955
CH$SMILES: CCCCCC
CH$IUPAC: InChI=1S/C6H14/c1-3-5-6-4-2/h3-6H2,1-2H3
CH$LINK: INCHIKEY VLKZOEOYAKHREP-UHFFFAOYSA-N
CH$LINK: COMPTOX DTXSID0021917

AC$INSTRUMENT: HITACHI RMU-6M
AC$INSTRUMENT_TYPE: EI-B
AC$MASS_SPECTROMETRY: MS_TYPE MS
AC$MASS_SPECTROMETRY: ION_MODE POSITIVE
AC$MASS_SPECTROMETRY: IONIZATION_ENERGY 70 eV

MS$FOCUSED_ION: ION_TYPE [M]+*

PK$SPLASH: splash10-052f-9000000000-d534432d96279fe04f73
PK$NUM_PEAK: 23
PK$PEAK: m/z int. rel.int.
  26 2 20
  27 26.2 262
  28 6.2 62
  29 4.04 40
  30 1.4 14
  37 1.3 13
  39 14.9 149
  40 0.25 3
  41 62.4 624
  42 36.6 366
  43 70.6 706
  44 0.24 2
  51 1.2 12
  53 2 20
  55 6.9 69
  56 4.9 49
  57 99.99 999
  58 4.5 45
  69 1 10
  70 0.1 1
  72 6.3 63
  86 25.7 257
  87 1.9 19