ACCESSION: MSBNK-Fac_Eng_Univ_Tokyo-JP009763
RECORD_TITLE: CYCLOPROPANE; EI-B; MS
DATE: 2016.01.19 (Created 2008.10.21, modified 2011.05.06)
AUTHORS: HISAHIRO HAGIWARA, CHEMICAL RESEARCH INSTITUTE OF NON-AQUEOUSSOLUTIONS TOHOKU UNIV.
LICENSE: CC BY-NC-SA

CH$NAME: CYCLOPROPANE
CH$COMPOUND_CLASS: N/A
CH$FORMULA: C3H6
CH$EXACT_MASS: 42.04695
CH$SMILES: C(C1)C1
CH$IUPAC: InChI=1S/C3H6/c1-2-3-1/h1-3H2
CH$LINK: CAS 75-19-4
CH$LINK: INCHIKEY LVZWSLJZHVFIQJ-UHFFFAOYSA-N
CH$LINK: COMPTOX DTXSID4058786

AC$INSTRUMENT: JEOL JMS-DX-300
AC$INSTRUMENT_TYPE: EI-B
AC$MASS_SPECTROMETRY: MS_TYPE MS
AC$MASS_SPECTROMETRY: ION_MODE POSITIVE
AC$MASS_SPECTROMETRY: IONIZATION_ENERGY 70 eV

MS$FOCUSED_ION: ION_TYPE [M]+*

PK$SPLASH: splash10-0006-9000000000-2e1149aecaee45f89566
PK$NUM_PEAK: 24
PK$PEAK: m/z int. rel.int.
  12 0.26 3
  13 0.45 5
  15 2.31 23
  16 0.24 2
  17 1.92 19
  18 9.28 93
  19 2.51 25
  20 1.97 20
  21 0.61 6
  25 0.86 9
  26 6.69 67
  27 25.89 259
  32 16.1 161
  36 1.62 16
  37 8.53 85
  38 12.52 125
  39 59.86 599
  40 30.23 302
  41 94.37 944
  42 99.99 999
  43 4.43 44
  45 0.28 3
  55 0.42 4
  57 0.26 3