ACCESSION: MSBNK-Fac_Eng_Univ_Tokyo-JP009941
RECORD_TITLE: TRIETHYLENEGLYCOL DIMETHACRYLATE; EI-B; MS
DATE: 2016.01.19 (Created 2008.10.21, modified 2011.05.06)
AUTHORS: KURARAY CO., LTD.
LICENSE: CC BY-NC-SA

CH$NAME: TRIETHYLENEGLYCOL DIMETHACRYLATE
CH$COMPOUND_CLASS: N/A
CH$FORMULA: C14H22O6
CH$EXACT_MASS: 286.14164
CH$SMILES: CC(=C)C(=O)OCCOCCOCCOC(=O)C(C)=C
CH$IUPAC: InChI=1S/C14H22O6/c1-11(2)13(15)19-9-7-17-5-6-18-8-10-20-14(16)12(3)4/h1,3,5-10H2,2,4H3
CH$LINK: INCHIKEY HWSSEYVMGDIFMH-UHFFFAOYSA-N
CH$LINK: COMPTOX DTXSID3029607

AC$INSTRUMENT: JEOL JMS-D-300
AC$INSTRUMENT_TYPE: EI-B
AC$MASS_SPECTROMETRY: MS_TYPE MS
AC$MASS_SPECTROMETRY: ION_MODE POSITIVE
AC$MASS_SPECTROMETRY: IONIZATION_ENERGY 70 eV

MS$FOCUSED_ION: ION_TYPE [M]+*

PK$SPLASH: splash10-03di-7900000000-39b663b79c155bac9892
PK$NUM_PEAK: 20
PK$PEAK: m/z int. rel.int.
  39 2.3 23
  40 1.6 16
  41 17.8 178
  43 0.3 3
  45 4.5 45
  68 1.6 16
  69 62.3 623
  70 0.47 5
  73 1.6 16
  84 2.3 23
  86 12 120
  87 0.17 2
  89 1.6 16
  100 3.1 31
  112 18.9 189
  113 99.99 999
  114 10 100
  143 5.2 52
  172 1.9 19
  200 5.8 58