ACCESSION: MSBNK-Fac_Eng_Univ_Tokyo-JP010347
RECORD_TITLE: TRIETHOXYMETHYLSILANE; EI-B; MS
DATE: 2016.01.19 (Created 2008.10.21, modified 2011.05.06)
AUTHORS: TAJIMA S, GUNMA COLLEGE OF TECHNOLOGY
LICENSE: CC BY-NC-SA

CH$NAME: TRIETHOXYMETHYLSILANE
CH$COMPOUND_CLASS: N/A
CH$FORMULA: C7H18O3Si
CH$EXACT_MASS: 178.10252
CH$SMILES: CCO[Si](C)(OCC)OCC
CH$IUPAC: InChI=1S/C7H18O3Si/c1-5-8-11(4,9-6-2)10-7-3/h5-7H2,1-4H3
CH$LINK: INCHIKEY CPUDPFPXCZDNGI-UHFFFAOYSA-N
CH$LINK: COMPTOX DTXSID6042490

AC$INSTRUMENT: HITACHI M-80A
AC$INSTRUMENT_TYPE: EI-B
AC$MASS_SPECTROMETRY: MS_TYPE MS
AC$MASS_SPECTROMETRY: ION_MODE POSITIVE
AC$MASS_SPECTROMETRY: IONIZATION_ENERGY 70 eV

MS$FOCUSED_ION: ION_TYPE [M]+*

PK$SPLASH: splash10-03di-6900000000-fef9cb2a196d57c1bd93
PK$NUM_PEAK: 48
PK$PEAK: m/z int. rel.int.
  14 3 30
  15 11.49 115
  26 3 30
  27 11.98 120
  28 1.97 20
  29 14.83 148
  31 3.02 30
  42 1.9 19
  43 22.51 225
  45 18.71 187
  46 1.17 12
  47 1.18 12
  58 5.64 56
  59 4.08 41
  60 2.19 22
  61 12.98 130
  62 3.11 31
  63 4.56 46
  73 4.9 49
  74 2.27 23
  75 1.82 18
  76 1.84 18
  77 31.17 312
  78 2.03 20
  79 8.81 88
  81 1.44 14
  88 1.81 18
  89 14.62 146
  90 1.73 17
  91 6.16 62
  103 3.37 34
  105 13.36 134
  106 1.17 12
  107 5.49 55
  117 2.27 23
  119 44.7 447
  120 4.31 43
  121 2.5 25
  133 53.63 536
  134 5.82 58
  135 7.99 80
  149 6.56 66
  163 99.99 999
  164 12.02 120
  165 4.6 46
  177 2.83 28
  178 7.52 75
  179 1.54 15