ACCESSION: MSBNK-Fac_Eng_Univ_Tokyo-JP010372
RECORD_TITLE: NAPHTHALENE; EI-B; MS
DATE: 2016.01.19 (Created 2008.10.21, modified 2011.05.06)
AUTHORS: HISAHIRO HAGIWARA, CHEMICAL RESEARCH INSTITUTE OF NON-AQUEOUSSOLUTIONS TOHOKU UNIV.
LICENSE: CC BY-NC-SA

CH$NAME: NAPHTHALENE
CH$COMPOUND_CLASS: N/A
CH$FORMULA: C10H8
CH$EXACT_MASS: 128.06260
CH$SMILES: c(c2)cc(c1)c(c2)ccc1
CH$IUPAC: InChI=1S/C10H8/c1-2-6-10-8-4-3-7-9(10)5-1/h1-8H
CH$LINK: CAS 91-20-3
CH$LINK: INCHIKEY UFWIBTONFRDIAS-UHFFFAOYSA-N
CH$LINK: COMPTOX DTXSID8020913

AC$INSTRUMENT: JEOL JMS-DX-300
AC$INSTRUMENT_TYPE: EI-B
AC$MASS_SPECTROMETRY: MS_TYPE MS
AC$MASS_SPECTROMETRY: ION_MODE POSITIVE
AC$MASS_SPECTROMETRY: IONIZATION_ENERGY 70 eV

MS$FOCUSED_ION: ION_TYPE [M]+*

PK$SPLASH: splash10-004i-7900000000-43781a61560faeff786d
PK$NUM_PEAK: 18
PK$PEAK: m/z int. rel.int.
  40 24.29 243
  41 6.45 65
  43 6.88 69
  44 8.67 87
  51 13.66 137
  55 9.91 99
  57 5.3 53
  63 8.17 82
  64 13.51 135
  75 5.03 50
  77 6.82 68
  78 7.38 74
  83 5.55 56
  102 7.64 76
  126 8.1 81
  127 15.02 150
  128 99.99 999
  129 13.47 135