ACCESSION: MSBNK-Fac_Eng_Univ_Tokyo-JP010694
RECORD_TITLE: VARELANONE; EI-B; MS
DATE: 2016.01.19 (Created 2008.10.21, modified 2011.05.06)
AUTHORS: EGUCHI S, FAC. OF SCIENCE, HIROSHIMA UNIV.
LICENSE: CC BY-NC-SA

CH$NAME: VARELANONE
CH$COMPOUND_CLASS: N/A
CH$FORMULA: C15H26O
CH$EXACT_MASS: 222.19837
CH$SMILES: N/A
CH$IUPAC: N/A

AC$INSTRUMENT: HITACHI RMU-6L
AC$INSTRUMENT_TYPE: EI-B
AC$MASS_SPECTROMETRY: MS_TYPE MS
AC$MASS_SPECTROMETRY: ION_MODE POSITIVE
AC$MASS_SPECTROMETRY: IONIZATION_ENERGY 70 eV

MS$FOCUSED_ION: ION_TYPE [M]+*

PK$SPLASH: splash10-0595-9400000000-4abce74ea1bc3c018a6b
PK$NUM_PEAK: 90
PK$PEAK: m/z int. rel.int.
  41 64 640
  42 13 130
  43 33 330
  44 1.1 11
  51 3 30
  52 2 20
  53 15 150
  54 0.6 6
  55 43 430
  56 10 100
  57 18 180
  58 0.5 5
  59 3 30
  65 7 70
  66 5 50
  67 3.8 38
  68 16 160
  69 52 520
  70 8 80
  71 0.7 7
  77 11 110
  78 3 30
  79 19 190
  80 0.6 6
  81 43.5 435
  82 27 270
  83 29 290
  84 1 10
  85 4 40
  91 16.5 165
  92 4 40
  93 2 20
  94 12 120
  95 55 550
  96 15.5 155
  97 1.7 17
  98 99.99 999
  99 8 80
  105 13.5 135
  106 0.65 7
  107 15 150
  108 7 70
  109 55.5 555
  110 2.2 22
  111 10 100
  119 10.5 105
  120 3 30
  121 1.3 13
  122 8 80
  123 40 400
  124 10 100
  125 8.25 83
  126 12 120
  127 2 20
  131 2 20
  133 0.6 6
  134 2 20
  135 9.5 95
  136 5 50
  137 0.8 8
  138 8 80
  139 7 70
  145 2 20
  147 0.45 5
  148 3 30
  149 7 70
  150 3.5 35
  151 2 20
  152 6 60
  153 1.5 15
  159 2 20
  161 2.1 21
  162 4 40
  163 2 20
  164 2 20
  165 0.3 3
  166 4.5 45
  177 4 40
  178 2 20
  179 2 20
  180 4 40
  189 5 50
  190 1 10
  192 0.15 2
  204 7 70
  205 2 20
  207 9.5 95
  208 0.15 2
  222 42 420
  223 8 80