ACCESSION: MSBNK-Fac_Eng_Univ_Tokyo-JP011559
RECORD_TITLE: 1,1,1,2-TETRAMETHYLDISILANE (2,2-D); EI-B; MS
DATE: 2016.01.19 (Created 2008.10.21, modified 2011.05.06)
AUTHORS: YAMAMOTO M, DEP. CHEMISTRY, FAC. SCIENCE, NARA WOMEN'S UNIV.
LICENSE: CC BY-NC-SA

CH$NAME: 1,1,1,2-TETRAMETHYLDISILANE (2,2-D)
CH$COMPOUND_CLASS: N/A
CH$FORMULA: C4H14Si2
CH$EXACT_MASS: 118.06340
CH$SMILES: [2H][Si]([2H])(C)[Si](C)(C)C
CH$IUPAC: InChI=1S/C4H14Si2/c1-5-6(2,3)4/h5H2,1-4H3/i5D2
CH$LINK: INCHIKEY VIPCDVWYAADTGR-BFWBPSQCSA-N

AC$INSTRUMENT: HITACHI RMU-6M
AC$INSTRUMENT_TYPE: EI-B
AC$MASS_SPECTROMETRY: MS_TYPE MS
AC$MASS_SPECTROMETRY: ION_MODE POSITIVE
AC$MASS_SPECTROMETRY: IONIZATION_ENERGY 20 eV

MS$FOCUSED_ION: ION_TYPE [M]+*

PK$SPLASH: splash10-00di-9200000000-4f23e58a056c9e17dbe5
PK$NUM_PEAK: 23
PK$PEAK: m/z int. rel.int.
  43 5.6 56
  44 1.6 16
  45 6 60
  58 1.4 14
  59 1.8 18
  60 4.3 43
  72 2.8 28
  73 99.99 999
  74 10.6 106
  75 4.3 43
  88 1 10
  101 2.6 26
  102 1.5 15
  103 3 30
  104 1.5 15
  105 11.8 118
  106 2.1 21
  107 1.4 14
  116 2.8 28
  118 2.3 23
  120 11.3 113
  121 2.3 23
  122 1.3 13