ACCESSION: MSBNK-Fac_Eng_Univ_Tokyo-JP011965
RECORD_TITLE: (2,4,6-TRIMETHYLBENZOYL)TRIPHENYLSILANE; EI-B; MS
DATE: 2016.01.19 (Created 2008.10.21, modified 2011.05.06)
AUTHORS: ISHIKAWA M, HIROSHIMA UNIV. FAC. TEQUNOLOGY
LICENSE: CC BY-NC-SA

CH$NAME: (2,4,6-TRIMETHYLBENZOYL)TRIPHENYLSILANE
CH$COMPOUND_CLASS: N/A
CH$FORMULA: C28H26OSi
CH$EXACT_MASS: 406.17529
CH$SMILES: C([Si](c(c4)cccc4)(c(c3)cccc3)c(c2)cccc2)(=O)c(c1C)c(cc(C)c1)C
CH$IUPAC: InChI=1S/C28H26OSi/c1-21-19-22(2)27(23(3)20-21)28(29)30(24-13-7-4-8-14-24,25-15-9-5-10-16-25)26-17-11-6-12-18-26/h4-20H,1-3H3
CH$LINK: INCHIKEY CERAAUHWEOIMMB-UHFFFAOYSA-N

AC$INSTRUMENT: SHIMADZU QP-1000
AC$INSTRUMENT_TYPE: EI-B
AC$MASS_SPECTROMETRY: MS_TYPE MS
AC$MASS_SPECTROMETRY: ION_MODE POSITIVE
AC$MASS_SPECTROMETRY: IONIZATION_ENERGY 70 eV

MS$FOCUSED_ION: ION_TYPE [M]+*

PK$SPLASH: splash10-0a4l-2596100000-e510b53022b9b94a4d2e
PK$NUM_PEAK: 47
PK$PEAK: m/z int. rel.int.
  51 4.2 42
  52 4.2 42
  53 14.7 147
  55 1.1 11
  65 2.1 21
  77 6.3 63
  78 3.2 32
  79 5.3 53
  91 8.4 84
  103 5.3 53
  105 15.8 158
  106 1.1 11
  115 1.1 11
  117 2.1 21
  119 7.4 74
  129 2.1 21
  147 9.5 95
  148 1.1 11
  155 6.3 63
  179 2.1 21
  180 8.4 84
  181 21.1 211
  182 3.2 32
  199 15.8 158
  200 3.2 32
  205 1.1 11
  206 23.2 232
  207 5.3 53
  255 1.1 11
  257 4.2 42
  259 99.99 999
  260 25.3 253
  261 6.3 63
  288 3.2 32
  299 1.1 11
  314 1.1 11
  316 27.4 274
  317 7.4 74
  318 1.1 11
  329 6.3 63
  330 3.2 32
  392 55.8 558
  393 18.9 189
  394 4.2 42
  406 11.6 116
  407 6.3 63
  408 2.1 21