ACCESSION: MSBNK-Fac_Eng_Univ_Tokyo-JP012329
RECORD_TITLE: NAPHTHALENE; CI-B; MS
DATE: 2016.01.19 (Created 2008.10.21, modified 2011.05.06)
AUTHORS: IIDA Y, DAISHIMA S, FAC. OF ENGINEERING, SEIKEI UNIV.
LICENSE: CC BY-NC-SA

CH$NAME: NAPHTHALENE
CH$COMPOUND_CLASS: N/A
CH$FORMULA: C10H8
CH$EXACT_MASS: 128.06260
CH$SMILES: c(c2)cc(c1)c(c2)ccc1
CH$IUPAC: InChI=1S/C10H8/c1-2-6-10-8-4-3-7-9(10)5-1/h1-8H
CH$LINK: CAS 91-20-3
CH$LINK: INCHIKEY UFWIBTONFRDIAS-UHFFFAOYSA-N
CH$LINK: COMPTOX DTXSID8020913

AC$INSTRUMENT: FINNIGAN-MAT 4500
AC$INSTRUMENT_TYPE: CI-B
AC$MASS_SPECTROMETRY: MS_TYPE MS
AC$MASS_SPECTROMETRY: ION_MODE POSITIVE
AC$MASS_SPECTROMETRY: IONIZATION_ENERGY 120 eV
AC$MASS_SPECTROMETRY: REAGENT_GAS METHANE

PK$SPLASH: splash10-004i-0900000000-0532459557fd0c543587
PK$NUM_PEAK: 7
PK$PEAK: m/z int. rel.int.
  128 9.75 98
  129 99.99 999
  130 12.88 129
  157 28.85 289
  158 3.65 37
  169 7.71 77
  170 1.12 11