ACCESSION: MSBNK-Fac_Eng_Univ_Tokyo-JP012366
RECORD_TITLE: TRIPHENYLMETHANE; CI-B; MS
DATE: 2016.01.19 (Created 2008.10.21, modified 2011.05.06)
AUTHORS: IIDA Y, DAISHIMA S, FAC. OF ENGINEERING, SEIKEI UNIV.
LICENSE: CC BY-NC-SA

CH$NAME: TRIPHENYLMETHANE
CH$COMPOUND_CLASS: N/A
CH$FORMULA: C19H16
CH$EXACT_MASS: 244.12520
CH$SMILES: c(c3)ccc(c3)C(c(c2)cccc2)c(c1)cccc1
CH$IUPAC: InChI=1S/C19H16/c1-4-10-16(11-5-1)19(17-12-6-2-7-13-17)18-14-8-3-9-15-18/h1-15,19H
CH$LINK: CAS 519-73-3
CH$LINK: INCHIKEY AAAQKTZKLRYKHR-UHFFFAOYSA-N
CH$LINK: COMPTOX DTXSID3060164

AC$INSTRUMENT: FINNIGAN-MAT 4500
AC$INSTRUMENT_TYPE: CI-B
AC$MASS_SPECTROMETRY: MS_TYPE MS
AC$MASS_SPECTROMETRY: ION_MODE POSITIVE
AC$MASS_SPECTROMETRY: IONIZATION_ENERGY 120 eV
AC$MASS_SPECTROMETRY: REAGENT_GAS METHANE

PK$SPLASH: splash10-014i-0900000000-6ff27daf493e2570cfe2
PK$NUM_PEAK: 3
PK$PEAK: m/z int. rel.int.
  167 99.99 999
  168 14.64 146
  243 1.6 16