ACCESSION: MSBNK-Keio_Univ-KO009120
RECORD_TITLE: Methylene blue; LC-ESI-IT; MS3; m/z: 284/241; [M+H]+
DATE: 2011.12.05 (Created 2008.05.12)
AUTHORS: Ojima Y, Kakazu Y, Horai H, Soga T, Institute for Advanced Biosciences, Keio Univ.
LICENSE: CC BY-NC-SA
COMMENT: KEIO_ID M047
COMMENT: [MS2] KO009117

CH$NAME: Methylene blue
CH$COMPOUND_CLASS: N/A
CH$FORMULA: C16H18N3S+
CH$EXACT_MASS: 284.12214
CH$SMILES: CN(C)c(c3)cc([s+1]1)c(c3)nc(c2)c(cc(N(C)C)c2)1
CH$IUPAC: InChI=1S/C16H18N3S/c1-18(2)11-5-7-13-15(9-11)20-16-10-12(19(3)4)6-8-14(16)17-13/h5-10H,1-4H3/q+1
CH$LINK: CAS 61-73-4
CH$LINK: KEGG C00220
CH$LINK: NIKKAJI J237.220G
CH$LINK: PUBCHEM SID:3520
CH$LINK: INCHIKEY RBTBFTRPCNLSDE-UHFFFAOYSA-N
CH$LINK: COMPTOX DTXSID3047009

AC$INSTRUMENT: LC/MSD Trap XCT, Agilent Technologies
AC$INSTRUMENT_TYPE: LC-ESI-IT
AC$MASS_SPECTROMETRY: MS_TYPE MS3
AC$MASS_SPECTROMETRY: ION_MODE POSITIVE
AC$MASS_SPECTROMETRY: COLLISION_ENERGY 0.90/0.75

MS$FOCUSED_ION: PRECURSOR_M/Z 284/241
MS$FOCUSED_ION: PRECURSOR_TYPE [M+H]+
MS$DATA_PROCESSING: WHOLE LC/MSD Trap Control and Data Analysis

PK$SPLASH: splash10-0006-0090000000-3b499bb01a3551febb88
PK$NUM_PEAK: 11
PK$PEAK: m/z int. rel.int.
  197.1 2.22 37
  198.1 5.51 93
  199.9 0.84 14
  209.2 6.66 112
  209.9 1.83 31
  226.0 20.56 347
  229.2 6.43 109
  241.1 59.19 999
  257.1 7.51 127
  273.0 3.98 67
  274.1 8.33 141