ACCESSION: MSBNK-NAIST-KNA00542
RECORD_TITLE: cis-Aconitic acid; LC-ESI-ITFT; MS; NEG
DATE: 2016.01.19 (Created 2009.11.18, modified 2011.08.03)
AUTHORS: Takahashi H, Kanaya S, Ogasawara N, Graduate School of Information Science, NAIST
LICENSE: CC BY-SA

CH$NAME: cis-Aconitate
CH$NAME: cis-Aconitic acid
CH$COMPOUND_CLASS: Natural Product
CH$FORMULA: C6H6O6
CH$EXACT_MASS: 174.01644
CH$SMILES: OC(=O)CC(C(O)=O)=C([H])C(O)=O
CH$IUPAC: InChI=1S/C6H6O6/c7-4(8)1-3(6(11)12)2-5(9)10/h1H,2H2,(H,7,8)(H,9,10)(H,11,12)/b3-1-
CH$LINK: CAS 585-84-2
CH$LINK: CHEBI 32805
CH$LINK: KEGG C00417
CH$LINK: KNAPSACK C00001177
CH$LINK: NIKKAJI J37.488A
CH$LINK: PUBCHEM 3707
CH$LINK: INCHIKEY GTZCVFVGUGFEME-IWQZZHSRSA-N
CH$LINK: COMPTOX DTXSID30883449

AC$INSTRUMENT: LTQ Orbitrap XL, Thermo Scientfic
AC$INSTRUMENT_TYPE: LC-ESI-ITFT
AC$MASS_SPECTROMETRY: MS_TYPE MS
AC$MASS_SPECTROMETRY: ION_MODE NEGATIVE
AC$MASS_SPECTROMETRY: COLLISION_ENERGY 35eV
AC$MASS_SPECTROMETRY: IONIZATION ESI
AC$CHROMATOGRAPHY: COLUMN_NAME TOSOH TSKgel ODS-100V 5um Part no. 21456
AC$CHROMATOGRAPHY: FLOW_GRADIENT 0min:3%, 45min:97%, 50min:97%, 50.1:3%, 57min:3% (acetonitrile)
AC$CHROMATOGRAPHY: FLOW_RATE 0.5 ml/min
AC$CHROMATOGRAPHY: RETENTION_TIME 10.976048 min
AC$CHROMATOGRAPHY: SOLVENT A 0.1%formate-water
AC$CHROMATOGRAPHY: SOLVENT B 0.1%formate-acetonitrile

MS$FOCUSED_ION: BASE_PEAK 173.008957

PK$SPLASH: splash10-00di-0911000000-0b53b4de13cb829e12ee
PK$NUM_PEAK: 453
PK$PEAK: m/z int. rel.int.
  102.807285 796.388428 1
  103.920296 1570.403687 2
  104.928313 887.009277 1
  105.713898 855.731567 1
  107.226968 800.902222 1
  108.722834 791.021606 1
  109.187379 765.609497 1
  110.282818 781.212769 1
  111.007120 1708.651611 2
  111.008667 39819.367188 43
  111.010435 2143.283203 2
  112.956156 1288.239258 1
  112.983606 1604.749146 2
  112.985421 30470.402344 33
  112.987236 1453.367798 2
  114.951389 11356.083008 12
  115.299354 809.467163 1
  115.381031 693.866943 1
  115.831690 783.124146 1
  117.435376 710.960693 1
  118.188661 933.591309 1
  118.764871 783.914673 1
  119.729513 904.519287 1
  120.477278 790.553467 1
  120.675895 665.886475 1
  122.430207 736.964111 1
  125.061189 957.228516 1
  125.309408 763.291626 1
  125.476271 828.399658 1
  126.121643 785.408936 1
  126.762569 730.625366 1
  127.364932 727.863281 1
  127.556874 899.628052 1
  128.993767 2086.358154 2
  129.014806 3883.436035 4
  129.015914 2460.569092 3
  129.017021 8691.554688 9
  129.019236 294834.593750 315
  129.021728 10939.831055 12
  129.023943 3751.137695 4
  129.026158 835.669922 1
  129.044712 1925.396973 2
  129.964947 921.326172 1
  130.022351 8007.802734 9
  130.023751 954.276978 1
  131.023041 993.455811 1
  134.733134 790.502197 1
  134.976931 809.422119 1
  136.485336 770.720093 1
  136.971952 3670.590332 4
  137.464219 757.993286 1
  138.969429 821.377075 1
  139.006578 1819.352783 2
  140.143374 888.071045 1
  140.963795 1853.963867 2
  145.890482 1668.162231 2
  148.952117 3035.271729 3
  151.000778 5491.729492 6
  152.004519 1025.693237 1
  154.943080 1483.353760 2
  154.998116 9241.148438 10
  156.073353 992.270264 1
  156.894379 1464.612061 2
  156.895493 844.718506 1
  156.959003 3535.720947 4
  158.997103 937.541870 1
  159.893276 1248.120972 1
  160.891855 1991.061768 2
  161.893591 1425.433838 2
  162.892928 3828.068848 4
  162.951076 3726.157471 4
  164.895156 1146.918701 1
  164.966788 5787.496582 6
  165.000419 1299.562500 1
  165.460274 779.302246 1
  168.033639 972.536377 1
  170.987678 1019.895630 1
  172.889951 1497.188721 2
  172.904125 869.944702 1
  172.954393 1110.896973 1
  172.969434 5559.203613 6
  172.993075 995.583374 1
  172.993935 702.837158 1
  172.998234 4169.963379 4
  173.001673 10515.562500 11
  173.005112 27769.931641 30
  173.008982 934335.750000 999
  173.012421 32695.957031 35
  173.014571 1593.110962 2
  173.015861 9052.920898 10
  173.018441 1463.687012 2
  173.019731 3577.137451 4
  173.027900 844.820557 1
  173.029191 1679.572144 2
  173.048543 5862.646484 6
  173.127705 1855.446533 2
  173.362501 892.399536 1
  173.961336 1041.682861 1
  174.008162 813.174072 1
  174.012065 50482.011719 54
  174.015535 2004.127930 2
  175.012962 6280.471680 7
  175.014711 1191.158203 1
  175.129814 940.984131 1
  175.778338 714.052002 1
  177.110285 760.086304 1
  180.961608 3915.039551 4
  180.963908 800.519775 1
  180.994727 983.813354 1
  182.937823 1931.927979 2
  184.469467 1404.997314 2
  188.932610 900.261841 1
  189.245535 904.948975 1
  190.945951 4157.446777 4
  190.947945 1288.105347 1
  191.318378 773.763916 1
  193.639612 888.438843 1
  193.805172 886.793945 1
  194.990119 2803.447754 3
  195.023561 1025.101196 1
  195.307906 911.479492 1
  197.285482 895.347290 1
  198.254959 862.848633 1
  200.948083 6780.754883 7
  203.143931 789.022095 1
  207.850357 1115.259155 1
  207.960232 1702.496582 2
  208.283568 860.777832 1
  208.956471 13309.251953 14
  210.953177 1144.975220 1
  217.814837 792.963989 1
  219.431413 785.813110 1
  222.510061 748.849243 1
  222.969169 824.119995 1
  223.977129 861.776855 1
  224.984289 5107.782227 5
  225.889175 734.332886 1
  226.927357 2575.925293 3
  230.077955 777.862915 1
  231.935298 1283.801392 1
  232.470099 840.460449 1
  232.940241 1028.103882 1
  234.926275 904.952393 1
  234.935119 14656.552734 16
  238.491655 708.568359 1
  238.767448 1019.246582 1
  239.970906 804.962524 1
  241.415057 801.292969 1
  242.148077 873.616333 1
  242.943094 943.322388 1
  244.256175 730.087158 1
  244.937712 5459.290527 6
  246.935000 1335.002686 1
  246.966528 2425.498779 3
  248.937523 1889.271973 2
  250.941972 1005.333496 1
  250.963754 2552.721436 3
  252.945646 3431.366943 4
  253.001899 1170.279785 1
  256.390793 827.301514 1
  257.335791 769.603394 1
  261.142198 716.874268 1
  262.904311 1607.522705 2
  263.600731 689.869507 1
  267.966366 955.948120 1
  268.974473 963.096069 1
  270.236541 833.338135 1
  271.918760 768.547363 1
  272.016209 842.871582 1
  276.943164 1098.550659 1
  278.981426 1699.313354 2
  281.027140 15135.871094 16
  281.282765 768.879028 1
  282.030256 1246.631226 1
  283.003670 1312.396484 1
  288.031190 857.992798 1
  290.955999 6794.807129 7
  292.993851 1366.472900 1
  294.952672 2249.492676 2
  295.187287 845.612549 1
  296.727338 811.956909 1
  296.992114 2411.136963 3
  298.963888 2372.153564 3
  299.010772 1610.188354 2
  302.961824 1236.026123 1
  303.008655 4086.152344 4
  303.675426 965.352051 1
  307.167591 779.953003 1
  308.981964 1046.462891 1
  311.510365 860.768433 1
  311.956467 1521.354126 2
  314.939281 2102.606934 2
  315.285918 846.722900 1
  324.778378 819.158691 1
  324.875712 863.283813 1
  324.894520 1188.552734 1
  324.903371 1618.724487 2
  324.990799 2479.119873 3
  325.016259 4253.791016 5
  326.992418 964.910767 1
  328.828879 810.594360 1
  329.555590 821.187500 1
  332.694077 922.308228 1
  333.754816 908.391357 1
  333.938055 1245.286011 1
  334.945680 7069.908691 8
  335.948566 1002.097046 1
  338.943129 1350.769043 1
  340.981233 3796.199707 4
  341.959988 818.140137 1
  342.953763 4999.457520 5
  344.465853 863.850708 1
  344.993090 823.492065 1
  345.020936 855.056396 1
  346.998143 3531.370117 4
  347.023790 30687.605469 33
  348.027469 3826.415039 4
  351.648349 837.180420 1
  355.946911 1186.093628 1
  356.953901 2439.976318 3
  358.336533 817.747314 1
  364.062331 804.003540 1
  364.603642 964.867432 1
  364.961674 1371.349609 1
  366.994762 945.213379 1
  367.002732 895.242676 1
  368.980603 808.746582 1
  369.006047 42848.105469 46
  370.009827 6702.168457 7
  370.982606 32250.179688 34
  371.504254 796.523438 1
  371.984979 4072.050781 4
  374.890397 1638.080078 2
  374.938400 1938.218750 2
  378.935504 2339.606934 3
  380.749539 814.237793 1
  384.971437 7999.825195 9
  390.940901 1199.746704 1
  390.987638 18183.203125 19
  391.991574 2727.974121 3
  393.344042 871.290771 1
  397.939673 2268.453857 2
  399.935862 32911.093750 35
  400.916844 1186.661011 1
  400.944145 12776.382813 14
  401.947110 1980.714111 2
  402.943146 1139.981079 1
  406.953688 6056.797852 6
  408.950980 6894.199219 7
  410.758467 843.642456 1
  412.970900 12271.405273 13
  418.879499 859.242188 1
  421.918302 1945.476563 2
  422.925441 16473.964844 18
  423.809237 994.417969 1
  423.929594 2335.659912 2
  430.933094 3974.930176 4
  435.838733 976.428345 1
  440.863593 1390.485962 1
  441.974473 900.253174 1
  443.899485 1168.758545 1
  444.906599 4030.356445 4
  445.671741 961.351929 1
  452.915321 2194.178711 2
  454.862845 1805.238281 2
  460.128028 881.058716 1
  461.235822 791.018799 1
  461.861535 1131.854492 1
  462.870220 1537.649536 2
  476.843793 1542.223511 2
  481.113720 844.112793 1
  484.851737 2831.372314 3
  484.863840 801.816772 1
  487.023294 921.858521 1
  495.652675 818.053955 1
  509.013671 897.129395 1
  510.897826 703.104736 1
  510.906553 884.372192 1
  510.939282 978.781494 1
  510.948010 773.559326 1
  511.255819 894.311768 1
  520.899396 1117.679199 1
  531.359509 765.607056 1
  532.307245 733.599609 1
  541.218497 989.422485 1
  542.875565 1179.410522 1
  543.023760 10807.441406 12
  544.024462 3292.245361 4
  547.953269 752.658813 1
  550.221271 890.084106 1
  555.266641 1051.851074 1
  558.988342 1711.254883 2
  565.004110 3902.788574 4
  570.046314 884.098145 1
  570.205773 845.995605 1
  586.987335 2174.851318 2
  587.988122 1198.988770 1
  588.961765 1370.341187 1
  594.419147 823.103882 1
  595.933433 2552.965332 3
  596.943418 1199.375854 1
  602.951295 2243.543945 2
  607.845225 866.203857 1
  608.967985 1971.916504 2
  617.915099 4059.775391 4
  618.923318 5324.794434 6
  619.928173 1206.843628 1
  626.930340 1406.195435 2
  627.868559 1087.469727 1
  628.880388 1095.151611 1
  630.947329 952.552246 1
  634.888184 1054.138916 1
  635.877652 1937.829834 2
  636.887654 1372.304565 1
  637.270445 1258.122314 1
  639.895442 1046.509277 1
  640.905840 2609.900879 3
  648.913451 1268.146240 1
  649.382164 1106.158691 1
  649.854516 1789.753662 2
  650.860367 2530.534912 3
  658.867298 1014.530396 1
  663.896391 832.268311 1
  674.261162 1948.694092 2
  675.994492 788.302124 1
  678.171403 867.971313 1
  688.225024 966.013794 1
  694.759129 909.526978 1
  706.308142 1114.897217 1
  717.036218 1818.999512 2
  722.894073 866.114502 1
  726.047660 891.119507 1
  732.772951 970.628296 1
  739.018646 1251.555054 1
  750.822157 894.498413 1
  756.828273 894.647339 1
  761.003348 1598.725342 2
  765.101100 998.306152 1
  766.859393 779.813354 1
  770.822621 791.881104 1
  770.846881 846.489014 1
  781.868898 826.385498 1
  782.981186 1201.373291 1
  787.366492 1039.559204 1
  789.277543 923.435791 1
  793.272517 1609.729370 2
  796.456401 821.445923 1
  798.336732 945.985718 1
  800.086890 915.544556 1
  806.599785 767.397339 1
  813.793083 1222.926392 1
  813.911519 1538.254883 2
  814.921466 1349.798096 1
  815.717572 915.124390 1
  822.926407 1270.475464 1
  823.868291 1448.047241 2
  838.091950 861.674072 1
  846.855812 1124.914307 1
  853.854999 929.359863 1
  866.779176 887.329468 1
  878.846069 964.028320 1
  885.797984 1266.960449 1
  891.835571 874.265625 1
  892.726877 939.953003 1
  896.914172 1037.230225 1
  897.691136 1093.608887 1
  905.974967 4267.225586 5
  908.411611 880.398926 1
  918.462216 947.644531 1
  919.815240 996.199829 1
  920.801616 787.598755 1
  920.812174 790.971680 1
  923.759674 1242.249878 1
  925.326473 1158.229248 1
  931.800270 1042.746582 1
  939.978973 1112.747925 1
  940.768960 1129.901123 1
  963.214573 779.089355 1
  992.843382 1076.504517 1
  1002.272197 918.370972 1
  1005.902930 1274.318604 1
  1005.969235 13771.649414 15
  1006.976678 2513.298096 3
  1007.043090 986.172729 1
  1016.485557 791.460571 1
  1032.343179 905.917480 1
  1046.262794 816.222046 1
  1065.389333 888.506714 1
  1065.994028 2122.828857 2
  1068.424559 961.956787 1
  1073.529892 899.210083 1
  1074.234653 1108.574951 1
  1076.846976 811.810181 1
  1088.958752 1045.095703 1
  1094.868930 1045.474365 1
  1098.574359 893.999512 1
  1105.965432 14186.774414 15
  1106.966746 3146.401367 3
  1116.336002 838.406006 1
  1123.352304 1013.854858 1
  1129.301258 1215.512329 1
  1138.360852 949.371216 1
  1148.220573 819.157959 1
  1150.598592 789.117676 1
  1153.738836 1149.309082 1
  1161.724467 805.023193 1
  1165.985321 16569.242188 18
  1166.986407 5067.135742 5
  1167.724875 845.982666 1
  1180.816026 1056.466797 1
  1189.836715 939.091553 1
  1196.947936 1096.970093 1
  1202.884668 781.397461 1
  1205.869611 964.870361 1
  1205.956640 9730.675781 10
  1206.954199 1508.996216 2
  1233.978145 2613.766113 3
  1250.137601 1158.968628 1
  1255.953397 1965.479492 2
  1261.361176 846.019775 1
  1265.875946 863.003296 1
  1265.978062 27436.638672 29
  1266.982865 8088.722656 9
  1267.980333 1843.094238 2
  1277.476500 836.382202 1
  1282.971940 2841.549561 3
  1286.042234 968.437500 1
  1299.159435 930.331177 1
  1305.739933 902.798706 1
  1307.390637 978.831543 1
  1319.948314 953.962402 1
  1333.966349 6132.789063 7
  1336.565919 864.461304 1
  1344.205519 788.852905 1
  1359.966751 1114.883667 1
  1365.974981 21227.333984 23
  1366.977040 5600.404297 6
  1382.957032 2460.674805 3
  1393.982841 1641.997070 2
  1414.140221 971.371826 1
  1417.270047 945.212524 1
  1423.652284 831.877319 1
  1433.958002 3777.308105 4
  1434.963914 1152.576172 1
  1443.930180 904.665161 1
  1444.801336 1041.530762 1
  1448.450067 952.456177 1
  1465.969084 11154.444336 12
  1466.966411 4530.615723 5
  1467.986008 902.868896 1
  1469.442900 856.270264 1
  1472.608730 816.926880 1
  1487.746386 1005.473511 1