ACCESSION: MSBNK-NAIST-KNA00546
RECORD_TITLE: D-Gluconic acid; LC-ESI-ITFT; MS; NEG
DATE: 2016.01.19 (Created 2009.11.18, modified 2011.08.03)
AUTHORS: Takahashi H, Kanaya S, Ogasawara N, Graduate School of Information Science, NAIST
LICENSE: CC BY-SA

CH$NAME: D-Gluconic acid
CH$NAME: D-Gluconate
CH$NAME: D-gluco-Hexonic acid
CH$COMPOUND_CLASS: Natural Product
CH$FORMULA: C6H12O7
CH$EXACT_MASS: 196.05830
CH$SMILES: OCC(O)C(O)C(O)C(O)C(O)=O
CH$IUPAC: InChI=1S/C6H12O7/c7-1-2(8)3(9)4(10)5(11)6(12)13/h2-5,7-11H,1H2,(H,12,13)
CH$LINK: CAS 526-95-4
CH$LINK: CHEBI 33198
CH$LINK: KEGG C00257
CH$LINK: KNAPSACK C00007303
CH$LINK: NIKKAJI J3.286G
CH$LINK: PUBCHEM 3556
CH$LINK: INCHIKEY RGHNJXZEOKUKBD-UHFFFAOYSA-N

AC$INSTRUMENT: LTQ Orbitrap XL, Thermo Scientfic
AC$INSTRUMENT_TYPE: LC-ESI-ITFT
AC$MASS_SPECTROMETRY: MS_TYPE MS
AC$MASS_SPECTROMETRY: ION_MODE NEGATIVE
AC$MASS_SPECTROMETRY: COLLISION_ENERGY 35eV
AC$MASS_SPECTROMETRY: IONIZATION ESI
AC$CHROMATOGRAPHY: COLUMN_NAME TOSOH TSKgel ODS-100V 5um Part no. 21456
AC$CHROMATOGRAPHY: FLOW_GRADIENT 0min:3%, 45min:97%, 50min:97%, 50.1:3%, 57min:3% (acetonitrile)
AC$CHROMATOGRAPHY: FLOW_RATE 0.5 ml/min
AC$CHROMATOGRAPHY: RETENTION_TIME 5.706950 min
AC$CHROMATOGRAPHY: SOLVENT A 0.1%formate-water
AC$CHROMATOGRAPHY: SOLVENT B 0.1%formate-acetonitrile

MS$FOCUSED_ION: BASE_PEAK 195.050552

PK$SPLASH: splash10-0002-0912020000-ed394aea8d30d27ddbaf
PK$NUM_PEAK: 512
PK$PEAK: m/z int. rel.int.
  100.156455 744.416748 1
  100.233385 731.985352 1
  100.287630 725.950806 1
  100.367561 671.165405 1
  100.923057 809.221680 1
  102.476632 694.899536 1
  104.037282 764.588989 1
  104.177362 720.413818 1
  105.206662 720.866211 1
  105.383850 763.812500 1
  105.461562 698.610962 1
  106.737978 668.030090 1
  106.943493 694.582703 1
  108.018617 1682.008911 2
  108.020314 48286.632813 64
  108.022223 1522.856812 2
  109.622590 796.565796 1
  109.912872 732.325928 1
  110.008726 697.903198 1
  110.176991 802.458374 1
  111.509086 854.018555 1
  112.928037 713.647095 1
  112.983606 1112.657104 1
  112.985648 32749.259766 43
  112.986782 905.695190 1
  112.987690 1195.994507 2
  113.581110 739.140869 1
  113.622287 803.033081 1
  113.643342 727.980713 1
  114.235021 754.315796 1
  114.458411 755.711060 1
  114.645341 801.151245 1
  114.874588 767.977417 1
  114.951622 3060.366211 4
  114.965827 887.326904 1
  115.457403 961.769165 1
  115.996972 700.491211 1
  117.136843 950.554443 1
  117.355351 831.900146 1
  121.946897 852.487549 1
  121.949950 775.670898 1
  123.771233 776.343994 1
  123.873016 752.700317 1
  124.014837 978.061035 1
  125.839799 815.123291 1
  126.030708 6844.116699 9
  128.544602 903.120728 1
  129.015360 945.589966 1
  129.018959 2189.948242 3
  131.384776 778.135498 1
  133.015327 5014.368652 7
  135.642738 785.489258 1
  136.955598 829.526733 1
  139.006887 10282.721680 14
  139.154703 852.534058 1
  139.892016 1936.682495 3
  140.046256 3650.336426 5
  140.371840 752.270264 1
  140.565910 765.139526 1
  140.966957 983.264893 1
  141.287192 793.324341 1
  142.890974 1810.071655 2
  143.889796 2880.885742 4
  144.891220 1156.517456 2
  144.958792 1161.536621 2
  145.436109 809.814697 1
  145.890482 3350.029297 4
  146.979873 819.018188 1
  148.011744 1030.346680 1
  148.252225 814.127686 1
  148.952461 6078.086914 8
  150.018055 3570.525879 5
  150.456422 923.739624 1
  151.020412 2496.333984 3
  151.021464 1823.000854 2
  151.022867 7858.116699 10
  151.026022 240633.781250 319
  151.028126 3786.158691 5
  151.029178 6073.198242 8
  151.031984 2187.470215 3
  151.605211 756.687378 1
  152.022932 1055.240723 1
  152.029307 10590.786133 14
  153.030103 946.894653 1
  153.553622 966.346802 1
  154.959478 998.994019 1
  156.537437 860.838745 1
  156.728915 782.036743 1
  156.894379 1457.157593 2
  156.959003 974.702148 1
  157.341996 817.893799 1
  158.892990 1279.804810 2
  158.938408 1154.067261 2
  159.030061 834.186035 1
  159.893658 2142.454590 3
  160.841743 1484.008911 2
  160.892241 1715.692261 2
  161.893591 1867.822632 2
  162.200698 837.603516 1
  162.838737 2386.779297 3
  162.892928 4246.729004 6
  164.894756 1473.618408 2
  166.910081 908.224365 1
  166.946346 1032.750488 1
  167.020543 29876.316406 40
  167.895041 804.229248 1
  168.962165 1029.976318 1
  169.532905 772.182983 1
  172.810093 721.900635 1
  174.334738 999.720459 1
  175.018648 1563.910278 2
  176.863838 864.137451 1
  177.039946 1430.219116 2
  184.406527 1901.931763 3
  184.739577 902.713135 1
  185.525780 912.328491 1
  187.002148 6453.160156 9
  188.123213 815.798462 1
  188.770313 803.071533 1
  188.933591 904.650024 1
  190.770101 732.807007 1
  191.006284 1054.587769 1
  191.019252 13806.882813 18
  192.022763 882.709106 1
  193.996466 818.360352 1
  194.908352 1279.466919 2
  194.977259 1596.646484 2
  195.002980 2940.256836 4
  195.033338 2196.056152 3
  195.037455 3460.554199 5
  195.039513 2588.552734 3
  195.042086 7020.639648 9
  195.044145 3292.571777 4
  195.046203 21098.154297 28
  195.050321 752836.437500 999
  195.054953 18283.480469 24
  195.059585 7219.074219 10
  195.062673 2352.310547 3
  195.064217 2063.531250 3
  195.067820 2269.250488 3
  195.076571 1004.072998 1
  195.098193 3163.542480 4
  195.192960 1010.799072 1
  196.053647 31682.621094 42
  197.054283 5776.992676 8
  199.631739 883.966064 1
  201.268143 922.491699 1
  202.381343 766.978760 1
  202.516310 804.099976 1
  203.075023 809.224609 1
  204.806633 721.065918 1
  205.238135 960.040649 1
  206.960413 2644.037109 4
  214.021257 10918.867188 14
  214.567111 817.359985 1
  214.798289 819.238770 1
  215.548467 733.658691 1
  219.011961 1054.896484 1
  220.513169 881.004395 1
  221.046183 1028.502563 1
  221.380610 835.386719 1
  224.919908 829.419556 1
  225.451719 773.956543 1
  225.672530 713.411377 1
  231.935298 853.623535 1
  233.939560 979.043823 1
  236.002790 948.144043 1
  237.019146 1220.899780 2
  238.966930 1067.108643 1
  239.014395 1539.861572 2
  240.878068 764.976440 1
  242.985309 869.477295 1
  243.185802 945.706177 1
  245.239276 784.126709 1
  245.442566 861.549805 1
  246.847049 910.775513 1
  248.031724 806.455200 1
  248.923425 1163.505615 2
  248.969435 2988.539063 4
  248.993187 2708.324219 4
  250.941221 958.678711 1
  252.266769 669.762817 1
  255.017263 811.607666 1
  255.895882 762.960205 1
  256.977400 1419.226563 2
  259.675013 943.474487 1
  261.253854 1000.390137 1
  265.014124 2499.677734 3
  265.018200 3886.036621 5
  269.503646 937.938721 1
  276.897891 2384.846191 3
  278.894290 1193.106201 2
  280.858993 3343.849121 4
  280.959507 1337.724487 2
  280.981752 1281.325806 2
  283.938737 3514.066406 5
  284.946592 4479.248535 6
  284.972038 1288.553589 2
  286.523435 862.451294 1
  286.942647 1309.627808 2
  291.039468 8215.379883 11
  293.017540 1629.583130 2
  293.067771 2310.490723 3
  294.974685 1996.108521 3
  298.104359 849.079224 1
  298.870154 2649.118164 4
  299.023472 2086.250977 3
  303.058487 48810.187500 65
  303.063470 2424.600586 3
  304.055709 921.389648 1
  304.061720 4017.757324 5
  304.918993 1869.438599 2
  306.806838 869.766235 1
  306.874875 2132.971191 3
  309.040462 1561.530640 2
  311.167860 1077.745972 1
  312.359718 752.424805 1
  313.505992 809.146118 1
  314.996310 6761.807617 9
  316.930689 1806.794067 2
  318.929208 1758.839966 2
  319.052993 5917.894531 8
  319.915022 833.072632 1
  319.930158 2892.646973 4
  320.056690 1259.739258 2
  320.922792 1907.780396 3
  320.929309 2594.547852 3
  322.919778 1180.616943 2
  322.929645 3671.635254 5
  324.931035 1452.443726 2
  325.040615 7052.213867 9
  325.182377 2114.679688 3
  327.317749 957.097290 1
  328.999057 2806.212402 4
  334.870413 1105.685181 1
  335.002437 1005.529419 1
  335.063842 2155.810059 3
  339.228614 759.232788 1
  342.763054 1233.954102 2
  344.978562 964.710815 1
  345.375972 778.684937 1
  347.062876 949.656006 1
  347.083643 102527.515625 136
  347.089752 1040.046143 1
  347.094639 1440.149414 2
  348.080221 1311.368286 2
  348.086356 9895.052734 13
  352.129739 846.985596 1
  360.884969 1124.968140 1
  363.078718 23200.183594 31
  368.844054 816.435669 1
  369.064979 8810.137695 12
  370.067655 971.943970 1
  372.069033 1023.127686 1
  378.896485 14998.771484 20
  383.379502 795.493042 1
  385.059931 3067.416016 4
  388.287811 815.749146 1
  391.108900 49471.628906 66
  392.111836 5181.113770 7
  392.163185 976.742065 1
  393.962324 846.365112 1
  396.906839 1480.369629 2
  398.097197 2800.087402 4
  399.094010 8697.486328 12
  401.003306 3243.647461 4
  408.994732 844.773560 1
  412.918582 1178.822754 2
  413.089843 37515.148438 50
  413.346933 792.657959 1
  413.817300 856.481934 1
  414.094174 2588.537109 3
  415.067022 21453.908203 28
  416.068957 1873.806763 2
  429.054778 1240.888184 2
  429.064853 1086.067139 1
  432.667297 898.239868 1
  433.029694 880.984253 1
  434.027356 946.901733 1
  435.025041 14347.754883 19
  436.029610 1357.651978 2
  437.048020 2117.723145 3
  444.019663 6522.469238 9
  445.027187 7859.605469 10
  446.031025 1191.973511 2
  453.697574 799.702148 1
  455.022343 1298.791504 2
  457.007483 2794.429199 4
  458.983347 1920.828247 3
  459.029796 1048.575317 1
  459.954655 1015.685181 1
  466.001695 1446.685547 2
  467.010633 3729.937500 5
  468.984633 1941.119995 3
  475.060549 944.715698 1
  475.320839 977.595703 1
  480.573864 776.106201 1
  485.479647 770.678955 1
  488.945864 1032.880005 1
  489.686142 869.533203 1
  493.365241 857.022949 1
  497.939259 1001.076904 1
  502.460124 1016.065430 1
  513.950596 140168.937500 186
  513.970409 2583.329102 3
  514.953662 9794.086914 13
  515.955239 1714.867188 2
  517.989451 1146.085083 2
  518.984266 972.625244 1
  519.312781 1063.411255 1
  523.994791 880.439331 1
  524.219213 1330.946045 2
  531.961689 62953.363281 84
  532.964499 5358.346191 7
  533.308706 1375.838257 2
  533.327321 1513.343506 2
  535.306085 2612.007324 3
  535.322465 1616.167603 2
  535.931395 1405.004028 2
  537.300587 1538.334229 2
  538.316179 770.607056 1
  541.218497 3284.427246 4
  543.215068 3073.752441 4
  544.216300 3366.522461 4
  545.215492 3268.696289 4
  546.219850 2784.054688 4
  547.217313 4381.905762 6
  549.220451 1424.704224 2
  555.264169 2639.690430 4
  557.137737 870.142700 1
  559.335576 818.715576 1
  559.343074 808.682007 1
  559.955905 40037.835938 53
  560.958613 3129.271484 4
  561.320247 3517.999023 5
  561.958983 1421.095581 2
  562.324104 1558.069702 2
  563.300345 10281.138672 14
  564.165187 985.104614 1
  564.304456 2546.842773 3
  567.279339 1125.740967 1
  579.311866 1256.125000 2
  581.939290 1508.994019 2
  590.807781 955.330566 1
  592.253813 1938.091675 3
  595.019232 917.233643 1
  602.445320 778.438354 1
  603.981986 2079.033203 3
  605.369736 2576.922363 3
  609.465145 852.174194 1
  609.937300 6587.745117 9
  611.302803 4176.368652 6
  611.914343 917.632080 1
  613.280755 1522.613770 2
  617.236596 1079.543457 1
  621.303975 1196.021729 2
  621.342014 13421.247070 18
  622.346901 4384.792969 6
  627.942875 897.227905 1
  629.309665 1113.243042 1
  631.130019 2293.267578 3
  631.288814 1445.592285 2
  633.105729 1150.135742 2
  638.171058 874.071655 1
  639.397248 857.694214 1
  641.347490 1142.712524 2
  647.859141 831.492554 1
  650.299184 981.316040 1
  655.046563 886.280518 1
  655.090909 890.624023 1
  662.058062 1056.506348 1
  665.985854 1081.401611 1
  678.037957 864.562012 1
  684.765604 903.932129 1
  696.183297 845.015991 1
  699.275322 1024.065063 1
  710.007357 14989.858398 20
  711.012812 1737.947632 2
  712.670556 748.895630 1
  715.110254 808.180176 1
  717.330139 7154.570801 9
  718.333007 2908.315918 4
  719.265085 2299.441406 3
  721.006653 848.415283 1
  721.262761 1349.940796 2
  722.262888 2833.118652 4
  723.265097 3296.228516 4
  724.265710 2096.524902 3
  725.261021 3233.217285 4
  726.269479 929.707886 1
  727.461648 786.169556 1
  731.990327 2443.913086 3
  761.122349 937.062866 1
  763.926943 1003.673950 1
  771.919516 815.012817 1
  779.964098 787.317871 1
  781.881290 1040.465454 1
  785.949203 1037.524048 1
  792.294108 891.163208 1
  796.889733 896.239502 1
  809.929641 1066.110474 1
  819.959582 753.108643 1
  822.280077 869.031860 1
  824.355491 981.305176 1
  826.811456 851.139648 1
  835.685993 876.587280 1
  859.958989 887.187622 1
  864.383151 830.391724 1
  880.053280 833.700928 1
  894.832022 1002.663086 1
  898.906846 836.034790 1
  905.974967 5670.044922 8
  907.982422 966.059814 1
  916.283667 5525.904785 7
  917.285361 2997.261719 4
  917.647633 3479.473633 5
  918.651565 3524.685059 5
  919.630801 2012.255737 3
  919.651877 1207.137085 2
  920.637990 1045.011230 1
  921.636262 1584.604248 2
  922.964522 905.356201 1
  929.932983 925.191895 1
  938.554070 1619.127563 2
  940.578182 1001.635864 1
  943.133960 812.289185 1
  952.789267 1075.605591 1
  955.088226 820.242554 1
  955.177458 848.804321 1
  957.938635 851.370117 1
  963.711778 838.930054 1
  981.963789 1149.048218 2
  988.589740 851.781616 1
  990.736703 941.588745 1
  1005.969235 23849.587891 32
  1006.976678 3352.898926 4
  1008.977944 907.164185 1
  1012.955776 790.674683 1
  1015.237648 827.227417 1
  1023.674944 9889.685547 13
  1024.678122 5550.000488 7
  1025.676569 2315.800781 3
  1026.925128 1120.298950 1
  1031.842028 904.767090 1
  1038.866203 805.133545 1
  1053.099165 869.396362 1
  1054.618110 911.698608 1
  1063.532462 941.880615 1
  1078.337323 943.295898 1
  1080.810216 1257.802734 2
  1080.897492 970.203979 1
  1083.210795 897.497559 1
  1090.923483 776.375854 1
  1092.907188 1272.059326 2
  1099.923947 768.199829 1
  1105.652799 833.538818 1
  1105.965432 21543.111328 29
  1106.465919 867.738403 1
  1106.918040 864.887939 1
  1106.966746 5670.044434 8
  1107.962453 922.051514 1
  1119.556303 943.501465 1
  1155.963226 1549.957031 2
  1156.958865 1074.417847 1
  1165.985321 19570.738281 26
  1166.986407 5314.450195 7
  1181.475586 788.219238 1
  1182.980837 4060.155762 5
  1205.956640 10902.967773 14
  1206.954199 1229.400757 2
  1208.357623 875.782837 1
  1220.269409 1033.939819 1
  1229.575772 967.923828 1
  1233.969956 2711.553711 4
  1234.977882 1306.419678 2
  1250.171005 955.694702 1
  1255.953397 3556.248535 5
  1261.310395 972.674316 1
  1264.167333 1104.249878 1
  1265.978062 42381.839844 56
  1266.889146 1001.515747 1
  1266.982865 8076.425781 11
  1267.980333 2131.294922 3
  1281.410582 1161.110107 2
  1282.971940 11773.948242 16
  1283.970969 2936.938477 4
  1287.079747 928.278076 1
  1305.953902 1916.731812 3
  1325.291863 856.559937 1
  1333.966349 3284.522949 4
  1334.970248 973.388428 1
  1355.948671 4224.756836 6
  1364.021754 906.415771 1
  1365.974981 24995.228516 33
  1366.977040 5285.171387 7
  1370.986731 1018.757202 1
  1382.957032 5459.284668 7
  1383.968112 3243.492188 4
  1395.833289 865.659546 1
  1396.030362 860.017456 1
  1396.079637 839.985718 1
  1430.179909 781.050903 1
  1433.958002 3624.180176 5
  1434.963914 1501.422241 2
  1445.953716 1044.666138 1
  1454.237220 858.178467 1
  1455.936047 1825.314575 2
  1460.660114 1023.143677 1
  1465.958479 9234.911133 12
  1466.966411 2244.453125 3
  1481.047289 1086.836426 1
  1482.955151 3794.971680 5