ACCESSION: MSBNK-NAIST-KNA00696
RECORD_TITLE: 4-Hydroxy-L-proline; LC-ESI-ITFT; MS; NEG
DATE: 2016.01.19 (Created 2009.11.19, modified 2011.08.03)
AUTHORS: Takahashi H, Kanaya S, Ogasawara N, Graduate School of Information Science, NAIST
LICENSE: CC BY-SA

CH$NAME: 4-Hydroxy-L-proline
CH$NAME: L-Hydroxyproline
CH$COMPOUND_CLASS: Natural Product
CH$FORMULA: C5H9NO3
CH$EXACT_MASS: 131.05824
CH$SMILES: OC(C1)CC(N1)C(O)=O
CH$IUPAC: InChI=1S/C5H9NO3/c7-3-1-4(5(8)9)6-2-3/h3-4,6-7H,1-2H2,(H,8,9)/t3?,4-/m0/s1
CH$LINK: CAS 51-35-4
CH$LINK: CHEBI 18240
CH$LINK: KEGG C01015
CH$LINK: KNAPSACK C00001370
CH$LINK: NIKKAJI J148.015D
CH$LINK: PUBCHEM 4260
CH$LINK: INCHIKEY PMMYEEVYMWASQN-BKLSDQPFSA-N

AC$INSTRUMENT: LTQ Orbitrap XL, Thermo Scientfic
AC$INSTRUMENT_TYPE: LC-ESI-ITFT
AC$MASS_SPECTROMETRY: MS_TYPE MS
AC$MASS_SPECTROMETRY: ION_MODE NEGATIVE
AC$MASS_SPECTROMETRY: COLLISION_ENERGY 35eV
AC$MASS_SPECTROMETRY: IONIZATION ESI
AC$CHROMATOGRAPHY: COLUMN_NAME TOSOH TSKgel ODS-100V 5um Part no. 21456
AC$CHROMATOGRAPHY: FLOW_GRADIENT 0min:3%, 45min:97%, 50min:97%, 50.1:3%, 57min:3% (acetonitrile)
AC$CHROMATOGRAPHY: FLOW_RATE 0.5 ml/min
AC$CHROMATOGRAPHY: RETENTION_TIME 4.811598 min
AC$CHROMATOGRAPHY: SOLVENT A 0.1%formate-water
AC$CHROMATOGRAPHY: SOLVENT B 0.1%formate-acetonitrile

MS$FOCUSED_ION: BASE_PEAK 130.050934

PK$SPLASH: splash10-01q9-0974210000-296abc972246f36d1b73
PK$NUM_PEAK: 519
PK$PEAK: m/z int. rel.int.
  100.272452 693.138794 1
  102.219193 701.828369 1
  103.920096 3571.483887 6
  103.935309 724.618286 1
  104.927907 1153.018311 2
  105.500859 775.625610 1
  105.848326 710.231689 1
  105.935822 3517.758545 6
  106.663222 761.294312 1
  106.943702 1342.443604 2
  109.159147 848.785278 2
  111.049337 948.138184 2
  111.165723 767.884155 1
  112.040226 2933.714111 5
  112.983606 1226.317017 2
  112.984286 1148.505127 2
  112.985421 38954.375000 70
  112.987463 1115.941040 2
  113.149876 828.669067 1
  114.307488 806.169556 1
  114.587151 692.319092 1
  114.951622 10690.402344 19
  116.065924 856.454590 2
  119.099360 824.531860 1
  122.218310 775.448730 1
  122.827620 742.346069 1
  123.946503 1542.349854 3
  125.416809 792.955566 1
  126.096493 909.318848 2
  126.099435 843.749023 2
  126.225000 918.729736 2
  127.798915 907.418945 2
  128.032612 1133.154541 2
  128.035075 24896.449219 45
  128.036718 898.989014 2
  129.038343 1416.999756 3
  129.335731 744.796997 1
  130.025152 2652.998535 5
  130.038318 1010.447754 2
  130.040560 1549.320801 3
  130.043922 2773.129395 5
  130.045043 1826.825928 3
  130.046443 5943.186523 11
  130.048685 15965.385742 29
  130.050927 552084.187500 999
  130.052328 17311.007813 31
  130.055690 6559.866211 12
  130.056811 1723.775635 3
  130.057652 1396.756592 3
  130.059053 1264.961792 2
  130.061014 1688.989258 3
  130.076709 2602.466064 5
  130.128297 1324.002808 2
  130.943173 1476.867554 3
  131.051664 983.649536 2
  131.053932 13952.997070 25
  131.653494 797.471191 1
  131.776015 769.097778 1
  132.054536 1138.578491 2
  132.513882 908.413086 2
  133.030400 879.495117 2
  135.382849 744.053345 1
  136.577265 678.762085 1
  139.006578 3321.158936 6
  139.980212 1072.582764 2
  142.219856 861.302002 2
  142.946173 2667.800781 5
  143.352593 880.451050 2
  143.470051 869.136597 2
  143.617241 815.069214 1
  143.707681 738.805664 1
  146.045414 2905.884277 5
  148.952117 1542.133423 3
  151.836476 823.246582 1
  153.389106 781.655762 1
  154.947088 6161.249512 11
  154.959478 2097.893311 4
  154.966767 979.658081 2
  156.894750 914.324463 2
  157.479306 783.692383 1
  158.040104 1032.307495 2
  158.924781 1332.558105 2
  160.841358 1603.691772 3
  161.459368 800.943481 1
  163.866269 960.352539 2
  163.982847 2830.953125 5
  164.348452 797.429565 1
  165.998396 946.584595 2
  166.024260 1499.771729 3
  166.027089 60653.226563 110
  166.030727 1652.705444 3
  167.030330 2115.239014 4
  167.493788 700.015991 1
  168.024174 14666.249023 27
  168.026232 878.030518 2
  168.657183 996.642212 2
  168.961750 1144.361328 2
  170.943754 862.992554 2
  173.117807 1043.493652 2
  174.918078 3980.710205 7
  176.055615 1890.345459 3
  176.763893 821.115356 1
  179.652467 827.670166 1
  181.974442 983.662354 2
  182.063522 1160.235840 2
  183.912644 1041.379761 2
  183.969674 13438.884766 24
  184.343146 1894.841309 3
  185.984962 5615.409180 10
  188.008705 6213.809570 11
  190.005772 2688.330811 5
  192.928345 1620.725098 3
  193.045857 5648.578125 10
  195.871214 800.521484 1
  196.974870 949.934692 2
  198.037850 13097.654297 24
  199.964685 3041.924805 6
  201.979964 1382.311768 3
  201.992980 1390.361328 3
  202.107472 848.952393 2
  205.617515 783.308105 1
  205.820430 787.805664 1
  207.972131 1862.092285 3
  209.988052 7755.029785 14
  210.999494 1180.645386 2
  211.985603 1060.396484 2
  213.045012 3065.999023 6
  214.913125 981.380127 2
  215.025075 777.332886 1
  215.027458 2406.956787 4
  216.967042 1215.209717 2
  217.930278 4290.493652 8
  219.203754 786.045654 1
  219.946332 4319.767090 8
  220.019688 909.773804 2
  220.954317 1617.951538 3
  221.153639 850.931641 2
  221.943008 957.108887 2
  221.961125 836.570068 2
  225.020635 881.512451 2
  226.038059 2064.256348 4
  226.429580 757.610107 1
  227.959055 3248.482666 6
  227.998727 1612.797241 3
  229.975131 5231.748535 9
  230.978622 959.590332 2
  230.982601 1465.243286 3
  231.551383 832.562500 2
  231.677916 989.235962 2
  232.924121 947.718506 2
  234.704654 1066.086792 2
  234.836501 868.480347 2
  235.986352 768.661743 1
  237.756461 931.274292 2
  237.982419 5791.228027 10
  241.039896 4704.995605 9
  241.528485 860.454712 2
  243.056170 2742.385986 5
  244.003221 1172.652832 2
  244.039951 3089.403320 6
  244.042832 3582.245605 6
  246.018955 4853.877441 9
  248.177177 1019.597046 2
  248.937523 1525.309204 3
  249.996094 10434.322266 19
  250.996056 1013.938843 2
  252.894730 974.434937 2
  253.132722 816.502441 1
  253.927440 1113.348877 2
  255.647033 724.603149 1
  255.922953 8936.965820 16
  255.993357 4421.938477 8
  256.786047 1041.430542 2
  257.920167 7354.265137 13
  260.008169 5833.826660 11
  261.012288 833.753174 2
  261.095961 2618.707764 5
  261.102338 6768.428711 12
  261.108715 302223.062500 547
  261.112700 8111.882813 15
  261.115092 6110.346191 11
  261.122267 2264.585205 4
  262.105592 1706.168335 3
  262.112006 24207.414063 44
  263.113028 2123.015869 4
  265.146218 928.206543 2
  265.951512 908.488647 2
  266.024455 1106.291138 2
  267.005951 2208.587402 4
  269.021985 1315.749512 2
  269.985765 1784.640625 3
  271.965360 793.545288 1
  272.992729 1102.791992 2
  273.939393 938.251099 2
  274.001080 1798.993896 3
  274.879796 2456.753906 4
  274.891851 1605.633911 3
  275.940194 1783.804199 3
  275.980035 2801.565918 5
  276.981481 790.114136 1
  277.030259 1028.199585 2
  281.937216 2742.963379 5
  282.008781 1290.497070 2
  283.050448 3437.913086 6
  283.083740 1288.727417 2
  283.090039 73637.585938 133
  283.095439 2238.384033 4
  283.988461 2514.540771 5
  284.093374 5101.317871 9
  285.061129 1604.209473 3
  285.066585 87749.765625 159
  285.071132 2654.005371 5
  285.074769 1805.808350 3
  285.973526 930.938232 2
  286.069486 6832.009766 12
  286.892146 809.383423 1
  287.964705 9473.030273 17
  289.944104 1299.678467 2
  289.962760 1086.375854 2
  291.547622 842.395142 2
  292.902910 1230.199097 2
  293.135083 788.652466 1
  293.496684 779.892578 1
  293.719102 839.979004 2
  295.040740 2201.686523 4
  296.001507 2968.481934 5
  297.084966 1677.354370 3
  298.217192 854.149658 2
  299.004911 829.749878 2
  299.063530 3422.224609 6
  302.870186 853.795410 2
  305.072962 2344.394775 4
  305.077996 916.472534 2
  310.913942 1357.148438 2
  310.995784 2129.152344 4
  311.015472 1245.225098 2
  311.167860 1153.912109 2
  312.860960 1130.849609 2
  313.004245 844.979248 2
  313.011568 30117.730469 54
  313.016800 1495.221313 3
  313.031448 1027.884888 2
  314.015254 1576.412109 3
  315.028000 23316.148438 42
  316.031854 3243.509766 6
  316.035038 4476.984375 8
  317.027716 916.975708 2
  317.042647 3331.265625 6
  318.040079 904.758911 2
  319.021771 977.793091 2
  321.040132 3691.475830 7
  321.043392 2984.822021 5
  322.039033 3711.629395 7
  323.029439 996.824341 2
  323.034924 40212.761719 73
  324.038748 4369.251953 8
  325.031758 2377.937988 4
  325.183485 1065.267578 2
  329.082503 5487.192383 10
  330.082944 1063.850342 2
  330.871802 1234.977905 2
  331.021948 2847.188232 5
  331.072019 12953.542969 23
  331.951253 2034.106934 4
  332.075837 1565.766724 3
  333.038291 12868.379883 23
  335.031400 1458.001099 3
  340.723238 808.816895 1
  342.006587 1181.869385 2
  342.388098 766.791626 1
  345.060896 19703.968750 36
  346.054849 1140.187866 2
  349.008407 2897.204834 5
  349.081097 1552.729126 3
  349.375786 942.236328 2
  350.007107 951.371826 2
  350.995190 810.871948 1
  351.003887 50468.070313 91
  351.010099 1116.384766 2
  351.077202 1728.478027 3
  352.007427 4425.202637 8
  352.138478 920.924683 2
  352.568339 768.968506 1
  352.921312 828.199463 1
  353.001494 12008.428711 22
  354.004810 1216.018188 2
  359.037291 2173.092529 4
  360.025165 2137.152100 4
  360.035490 1847.379150 3
  361.032673 58820.003906 106
  362.036608 5625.851074 10
  363.269627 777.669434 1
  363.991472 911.533325 2
  365.942372 5384.893066 10
  368.043695 1045.568726 2
  369.040869 8409.563477 15
  369.840454 927.801392 2
  375.097561 3154.811768 6
  376.689241 999.242676 2
  377.076293 4474.362793 8
  378.022929 1042.935181 2
  379.932525 973.446533 2
  381.054316 6387.809570 12
  383.012446 981.231323 2
  383.033690 3592.063721 6
  389.441030 808.482056 1
  392.166119 7805.356445 14
  393.156926 901.935547 2
  393.168709 949.443115 2
  401.086762 1564.611450 3
  402.011062 810.931641 1
  402.035429 1518.012451 3
  403.591867 819.588745 1
  406.900958 2707.433350 5
  408.392192 936.734863 2
  412.823483 1392.354980 3
  414.135570 3335.285889 6
  414.765233 798.917847 1
  416.125083 17878.029297 32
  417.127634 2794.673828 5
  419.023690 2935.181152 5
  422.606835 733.205688 1
  426.020086 4720.575195 9
  427.058629 3815.248779 7
  429.021198 1223.876709 2
  430.112871 10719.335938 19
  431.115684 1412.073608 3
  436.129398 4385.671387 8
  441.974473 1078.478394 2
  443.733436 770.582642 1
  444.090379 5877.845703 11
  445.076855 3677.850830 7
  445.089273 4164.632324 8
  446.071961 1940.323730 4
  446.086201 106612.992188 193
  447.088269 10995.615234 20
  448.084757 1325.668213 2
  448.091925 1162.110229 2
  449.025251 1169.583618 2
  450.082341 1264.408936 2
  452.100580 2576.050781 5
  453.099305 896.542969 2
  454.079406 1906.184082 3
  454.094031 14159.692383 26
  454.916002 729.472046 1
  462.129820 18436.193359 33
  463.009479 1407.274658 3
  463.131852 3502.973633 6
  463.874663 764.252319 1
  464.424435 852.491455 2
  469.943607 999.113159 2
  473.826603 761.045166 1
  477.040583 1001.316772 2
  481.053912 1182.156616 2
  487.088280 1062.046631 2
  489.849966 888.732178 2
  489.940104 1332.273315 2
  491.083325 3333.694336 6
  494.015990 814.495605 1
  495.044469 898.995117 2
  497.945557 875.789795 2
  503.039416 1066.139771 2
  504.044901 1547.520508 3
  504.085525 846.304565 2
  505.173511 842.492554 2
  506.424318 862.355103 2
  512.113034 5765.805664 10
  513.099744 944.356567 2
  514.071690 4425.242676 8
  518.892695 983.190308 2
  521.997232 858.984863 2
  522.080611 1062.010742 2
  522.752879 765.174927 1
  528.956391 794.421509 1
  529.943797 1025.381592 2
  532.316527 879.558838 2
  533.893226 1749.327393 3
  537.503005 880.098267 2
  543.217460 919.707520 2
  544.216300 1061.471924 2
  544.233090 923.275146 2
  547.183456 49779.371094 90
  548.185985 9369.811523 17
  549.186408 1146.671753 2
  552.905993 837.726318 2
  554.020369 1111.824341 2
  555.491664 919.265869 2
  558.898464 2196.588867 4
  566.033135 973.993652 2
  573.336425 759.320068 1
  574.039957 1796.176025 3
  576.043392 1265.421387 2
  576.134825 8609.333008 16
  581.035920 1785.652588 3
  581.875641 1036.959229 2
  582.058660 1744.694092 3
  583.153272 1915.394775 3
  585.148485 832.539795 2
  598.960029 780.826050 1
  599.126232 6151.731934 11
  604.001617 1381.063843 2
  609.760889 830.986450 2
  609.783647 769.959961 1
  620.018584 1352.280762 2
  620.996871 2425.491211 4
  623.480684 1042.494995 2
  633.238174 883.065918 2
  644.470415 879.244507 2
  649.951552 1053.953003 2
  652.942128 752.786743 1
  661.096798 1812.356689 3
  664.947990 1112.335449 2
  665.087312 793.849243 1
  667.039169 1059.692993 2
  667.117291 936.640747 2
  677.068321 5039.011719 9
  678.071315 1413.708008 3
  681.742307 1108.683350 2
  689.957725 1671.700928 3
  705.096821 1088.139648 2
  713.130870 1148.786499 2
  716.873007 897.751465 2
  725.401267 886.554810 2
  729.080572 881.760498 2
  736.108430 973.316406 2
  742.064534 3043.689697 6
  745.056283 975.406860 2
  761.114415 1058.461304 2
  761.130284 846.030396 2
  762.119091 3155.785156 6
  763.121775 955.392578 2
  770.131687 1017.427246 2
  771.214967 853.602051 2
  778.164670 1095.782959 2
  783.026720 904.191406 2
  783.925802 1160.896606 2
  785.341777 902.439941 2
  798.191855 1163.036865 2
  803.036699 765.973877 1
  805.985559 1002.130127 2
  808.863760 886.474854 2
  815.273192 768.713013 1
  818.104062 1024.313232 2
  827.139448 1294.875854 2
  836.663591 939.485840 2
  861.710232 777.587769 1
  885.096102 814.546509 1
  904.102549 815.285156 1
  904.128230 844.793457 2
  905.974967 2973.290527 5
  915.163298 1414.062256 3
  934.120722 811.530884 1
  939.804765 1016.489502 2
  953.094945 986.813354 2
  962.994343 828.386353 1
  969.714104 830.691772 2
  970.541879 840.491089 2
  978.889824 910.951294 2
  993.523435 943.370605 2
  994.583344 856.566284 2
  1005.969235 13983.251953 25
  1006.970641 3582.526611 6
  1010.323527 1043.394653 2
  1015.989788 1062.175537 2
  1020.347793 1145.275757 2
  1048.587627 1070.569214 2
  1055.576410 1001.608398 2
  1062.255816 883.889648 2
  1068.668730 987.645630 2
  1105.909843 1018.830933 2
  1105.965432 18299.765625 33
  1106.966746 3625.372559 7
  1110.454111 2245.971191 4
  1117.859673 860.989136 2
  1165.985321 12870.470703 23
  1166.993939 3507.674072 6
  1182.973150 1164.218018 2
  1200.892996 821.525269 1
  1204.991929 896.356689 2
  1205.956640 8954.512695 16
  1206.819535 890.260864 2
  1206.962121 1568.260498 3
  1207.778513 942.441162 2
  1228.078313 784.986694 1
  1232.088523 957.453613 2
  1233.978145 1571.942993 3
  1253.467931 873.749023 2
  1254.290004 770.843994 1
  1255.953397 3554.685059 6
  1257.948782 1093.824097 2
  1265.978062 35412.335938 64
  1266.982865 7254.307129 13
  1282.971940 2522.388672 5
  1305.953902 2077.438232 4
  1311.831787 891.747192 2
  1319.359600 899.869263 2
  1333.966349 4114.326660 7
  1334.961032 1789.132080 3
  1347.526399 1087.432617 2
  1352.446266 1109.334229 2
  1355.948671 1441.044556 3
  1365.974981 26312.150391 48
  1366.977040 9328.412109 17
  1367.989761 1422.443237 3
  1368.066238 988.580444 2
  1371.159380 1035.619141 2
  1382.966749 2237.921143 4
  1398.517063 912.417114 2
  1425.877436 979.702148 2
  1431.775327 832.368286 2
  1433.958002 3752.749756 7
  1434.963914 2667.130615 5
  1457.932294 1070.803345 2
  1460.639020 1140.450073 2
  1465.969084 13092.505859 24
  1466.966411 2548.865967 5
  1478.144076 1121.282104 2
  1482.955151 1721.153320 3
  1497.157967 999.977051 2