ACCESSION: MSBNK-Nihon_Univ-NU000738
RECORD_TITLE: 3,7,12-Trioxo-5a-cholan-24-oic acid; LC-ESI-TOF; MS; NEGATIVE; in source decay -90 V
DATE: 2018.02.26
AUTHORS: Takashi Iida, Department of Chemistry, College of Humanities and Sciences, Nihon University
LICENSE: CC BY
COPYRIGHT: Takashi Iida, Department of Chemistry, College of Humanities and Sciences, Nihon University
COMMENT: BA-128-90. In-source decay
COMMENT: 1 microL of the bile acid in MeOH solution was flow injected. Sampling interval was 1 Hz.
COMMENT: This record was created by the financial support of MEXT/JSPS KAKENHI Grant Number 17HP8021 (2017) to the MassBank database committee of the Mass Spectrometry Society of Japan.

CH$NAME: 3,7,12-Trioxo-5a-cholan-24-oic acid
CH$COMPOUND_CLASS: Natural Product; Bile acids
CH$FORMULA: C24H34O5
CH$EXACT_MASS: 402.24063
CH$SMILES: CC(CCC(=O)O)C1CCC2C1(C(=O)CC3C2C(=O)CC4C3(CCC(=O)C4)C)C
CH$IUPAC: InChI=1S/C24H34O5/c1-13(4-7-21(28)29)16-5-6-17-22-18(12-20(27)24(16,17)3)23(2)9-8-15(25)10-14(23)11-19(22)26/h13-14,16-18,22H,4-12H2,1-3H3,(H,28,29)/t13-,14-,16-,17+,18+,22+,23+,24-/m1/s1
CH$LINK: CHEMSPIDER 4447208
CH$LINK: INCHIKEY OHXPGWPVLFPUSM-NHJLYVEHSA-N
CH$LINK: LIPIDBANK BBA0659
CH$LINK: PUBCHEM CID:5284120

AC$INSTRUMENT: JMS-T100LP, JEOL
AC$INSTRUMENT_TYPE: LC-ESI-TOF
AC$MASS_SPECTROMETRY: MS_TYPE MS
AC$MASS_SPECTROMETRY: ION_MODE NEGATIVE
AC$MASS_SPECTROMETRY: IONIZATION ESI
AC$MASS_SPECTROMETRY: ORIFICE_TEMPERATURE 80 C
AC$MASS_SPECTROMETRY: ORIFICE_VOLTAGE -90 V
AC$MASS_SPECTROMETRY: SCAN_RANGE_M/Z 100-1000

PK$SPLASH: splash10-0udi-0000900010-fdaccd001881a5f8b1df
PK$NUM_PEAK: 13
PK$PEAK: m/z int. rel.int.
  61.97 7 70
  68.98 3 35
  96.95 2 24
  383.22 6 58
  401.23 100 999
  402.24 31 306
  403.24 7 68
  433.26 18 178
  434.27 10 97
  437.22 2 25
  803.48 18 176
  804.49 10 100
  835.53 4 36