ACCESSION: MSBNK-PFOS_research_group-FFF00146
RECORD_TITLE: 5-beta-Androstane-3-alpha,17-beta-diol; LC-APPI-QQ; MS2; CE:50 V; [M-2H2O+H]+
DATE: 2016.01.19 (Created 2011.04.04, modified 2011.06.20)
AUTHORS: Atsushi Yamamoto, PFOS.jp
LICENSE: CC BY-SA
COPYRIGHT: PFOS.jp
COMMENT: Disclaimer: While authors make an effort to ensure that the content of this record is accurate, the authors make no representations or warranties in relation to the accuracy or completeness of the record. This record do not reflect any viewpoints of the affiliation and organization to which the authors belong.

CH$NAME: 5-beta-Androstane-3-alpha,17-beta-diol
CH$NAME: Etiocholane-3-alpha,17-beta-diol
CH$COMPOUND_CLASS: Natural Product; Steroid hormone
CH$FORMULA: C19H32O2
CH$EXACT_MASS: 292.24023
CH$SMILES: OC(C4)CC([H])(C3)C(C)(C4)C(C2)C(C3)C(C1)C(C)(C2)C(O)C1
CH$IUPAC: InChI=1S/C19H32O2/c1-18-9-7-13(20)11-12(18)3-4-14-15-5-6-17(21)19(15,2)10-8-16(14)18/h12-17,20-21H,3-11H2,1-2H3/t12-,13-,14?,15?,16?,17+,18?,19?/m1/s1
CH$LINK: CAS 1851-23-6
CH$LINK: INCHIKEY CBMYJHIOYJEBSB-GCFMDFLISA-N

AC$INSTRUMENT: API2000
AC$INSTRUMENT_TYPE: LC-APPI-QQ
AC$MASS_SPECTROMETRY: MS_TYPE MS2
AC$MASS_SPECTROMETRY: ION_MODE POSITIVE
AC$CHROMATOGRAPHY: RETENTION_TIME 0.820850 min

MS$FOCUSED_ION: BASE_PEAK 81.199997
MS$FOCUSED_ION: PRECURSOR_M/Z 257.300000
MS$FOCUSED_ION: PRECURSOR_TYPE [M-2H2O+H]+

PK$SPLASH: splash10-0apl-9300000000-cae82daabb3ff1427db5
PK$NUM_PEAK: 245
PK$PEAK: m/z int. rel.int.
  38.599998 1350.500000 1
  39.000000 6752.500000 1
  39.275000 5402.000000 1
  40.099998 4051.500000 1
  41.093023 348429.000000 30
  43.145000 270100.000000 23
  44.700001 1350.500000 1
  45.000000 1350.500000 1
  45.200001 1350.500000 1
  50.500000 1350.500000 1
  50.700001 1350.500000 1
  51.150000 10804.000000 1
  51.799999 1350.500000 1
  52.150000 2701.000000 1
  53.108889 121545.000000 10
  55.094182 5060323.500000 429
  56.781250 21608.000000 2
  57.114705 91834.000000 8
  58.799999 1350.500000 1
  59.200001 1350.500000 1
  60.900002 1350.500000 1
  61.650000 2701.000000 1
  62.400002 1350.500000 1
  63.150000 2701.000000 1
  63.400002 1350.500000 1
  67.124811 11779061.000000 999
  69.118372 1940668.500000 165
  70.199997 8103.000000 1
  70.800003 2701.000000 1
  71.271429 9453.500000 1
  74.450001 2701.000000 1
  74.775002 5402.000000 1
  75.099998 6752.500000 1
  75.500000 6752.500000 1
  77.068824 1815072.000000 154
  79.072026 8921403.000000 757
  81.115149 11660217.000000 989
  83.099334 1420726.000000 120
  84.400002 4051.500000 1
  85.000000 1350.500000 1
  85.400002 1350.500000 1
  87.000000 1350.500000 1
  87.300003 1350.500000 1
  88.483334 8103.000000 1
  91.077563 9510221.000000 807
  93.100451 8979474.500000 762
  95.071183 7385884.500000 626
  96.199997 6752.500000 1
  96.978261 31061.500000 3
  97.300003 17556.500000 1
  97.750000 2701.000000 1
  98.800003 1350.500000 1
  99.149998 2701.000000 1
  99.500000 1350.500000 1
  100.649998 2701.000000 1
  101.000000 1350.500000 1
  101.300003 1350.500000 1
  101.549999 8103.000000 1
  101.800003 4051.500000 1
  103.075410 494283.000000 42
  105.058010 10150358.000000 861
  107.064526 3616639.000000 307
  109.133146 1682723.000000 143
  109.900002 5402.000000 1
  110.199997 5402.000000 1
  110.900002 1350.500000 1
  111.099998 1350.500000 1
  111.400002 2701.000000 1
  111.599998 1350.500000 1
  112.999997 8103.000000 1
  114.099998 8103.000000 1
  115.073000 135050.000000 11
  117.107250 1080400.000000 92
  119.078113 4023139.500000 341
  121.112552 968308.500000 82
  121.900002 2701.000000 1
  123.041837 132349.000000 11
  123.800003 1350.500000 1
  124.199997 1350.500000 1
  124.900002 2701.000000 1
  125.099998 2701.000000 1
  125.400002 2701.000000 1
  125.900002 2701.000000 1
  126.099998 2701.000000 1
  127.099998 13505.000000 1
  128.265515 78329.000000 7
  129.102233 241739.500000 21
  131.142093 1135770.500000 96
  133.143673 1301882.000000 110
  134.388456 35113.000000 3
  135.134342 491582.000000 42
  136.000000 2701.000000 1
  136.199997 1350.500000 1
  136.399994 1350.500000 1
  136.699997 2701.000000 1
  137.000000 2701.000000 1
  137.399994 5402.000000 1
  140.100006 1350.500000 1
  140.449997 2701.000000 1
  140.762501 10804.000000 1
  141.100006 8103.000000 1
  141.300003 17556.500000 1
  143.108333 194472.000000 16
  145.069679 926443.000000 79
  147.122716 1004772.000000 85
  147.899999 16206.000000 1
  148.379996 13505.000000 1
  149.125000 264698.000000 22
  150.100006 1350.500000 1
  151.000000 6752.500000 1
  151.300003 4051.500000 1
  151.500000 1350.500000 1
  151.699997 2701.000000 1
  152.000000 6752.500000 1
  152.800003 4051.500000 1
  153.199999 9453.500000 1
  153.800003 4051.500000 1
  154.160001 13505.000000 1
  155.127272 29711.000000 3
  156.199997 10804.000000 1
  156.699997 12154.500000 1
  157.178824 114792.500000 10
  157.800003 13505.000000 1
  158.242307 35113.000000 3
  159.145170 475376.000000 40
  161.203415 553705.000000 47
  162.100001 8103.000000 1
  163.000000 12154.500000 1
  163.199997 16206.000000 1
  163.429996 13505.000000 1
  163.699997 1350.500000 1
  164.600006 1350.500000 1
  164.849998 2701.000000 1
  165.100006 8103.000000 1
  165.500000 1350.500000 1
  165.699997 4051.500000 1
  165.899994 1350.500000 1
  166.100006 1350.500000 1
  167.000000 1350.500000 1
  167.199997 2701.000000 1
  167.449997 2701.000000 1
  167.699997 1350.500000 1
  168.000000 5402.000000 1
  169.062504 10804.000000 1
  169.316668 8103.000000 1
  170.100006 8103.000000 1
  171.105262 51319.000000 4
  171.600006 6752.500000 1
  172.199997 18907.000000 2
  173.229033 167462.000000 14
  174.100002 10804.000000 1
  174.399994 4051.500000 1
  175.094447 145854.000000 12
  175.899994 1350.500000 1
  176.199997 1350.500000 1
  177.100006 1350.500000 1
  177.449997 2701.000000 1
  177.899994 1350.500000 1
  178.100006 1350.500000 1
  178.399994 1350.500000 1
  179.399994 2701.000000 1
  180.899994 4051.500000 1
  182.100006 2701.000000 1
  182.700005 5402.000000 1
  183.300003 6752.500000 1
  183.699997 1350.500000 1
  183.899994 5402.000000 1
  184.300003 4051.500000 1
  184.737499 10804.000000 1
  185.158334 32412.000000 3
  186.066664 24309.000000 2
  187.213462 140452.000000 12
  189.299999 45917.000000 4
  189.899994 1350.500000 1
  190.500000 2701.000000 1
  190.800003 1350.500000 1
  191.199997 1350.500000 1
  192.000000 1350.500000 1
  192.300003 1350.500000 1
  193.000000 2701.000000 1
  194.849998 2701.000000 1
  195.250000 5402.000000 1
  195.500000 1350.500000 1
  195.800003 1350.500000 1
  196.500000 1350.500000 1
  196.699997 1350.500000 1
  197.166667 8103.000000 1
  198.000000 1350.500000 1
  198.399994 4051.500000 1
  199.399994 24309.000000 2
  200.009998 27010.000000 2
  201.177967 159359.000000 14
  202.100006 24309.000000 2
  202.325001 16206.000000 1
  203.075005 5402.000000 1
  207.800003 1350.500000 1
  211.199997 1350.500000 1
  211.399994 2701.000000 1
  212.899994 8103.000000 1
  213.100006 16206.000000 1
  214.037502 10804.000000 1
  214.300003 12154.500000 1
  215.184620 17556.500000 1
  216.000000 1350.500000 1
  216.600006 1350.500000 1
  217.699997 1350.500000 1
  217.899994 1350.500000 1
  223.899994 1350.500000 1
  224.100006 1350.500000 1
  225.100006 1350.500000 1
  225.300003 1350.500000 1
  226.146874 86432.000000 7
  227.161540 70226.000000 6
  228.129730 199874.000000 17
  228.944441 24309.000000 2
  229.416662 8103.000000 1
  229.699997 1350.500000 1
  231.199997 1350.500000 1
  231.399994 2701.000000 1
  236.699997 1350.500000 1
  237.199997 1350.500000 1
  237.399994 4051.500000 1
  238.100006 2701.000000 1
  238.724998 5402.000000 1
  239.137503 21608.000000 2
  239.500000 8103.000000 1
  239.800003 4051.500000 1
  240.000000 2701.000000 1
  240.199997 1350.500000 1
  240.399994 1350.500000 1
  240.699997 1350.500000 1
  241.228572 9453.500000 1
  241.899994 4051.500000 1
  242.199997 8103.000000 1
  242.449997 8103.000000 1
  242.699997 5402.000000 1
  253.199997 1350.500000 1
  254.983332 8103.000000 1
  255.399994 5402.000000 1
  255.699997 1350.500000 1
  255.899994 1350.500000 1
  256.349991 5402.000000 1
  257.299988 12154.500000 1
  257.562504 10804.000000 1
  257.799988 1350.500000 1