ACCESSION: MSBNK-PFOS_research_group-FFF00149
RECORD_TITLE: 5-beta-Androstane-3-alpha,17-beta-diol; LC-APPI-QQ; MS2; CE:20 V; [M-2H2O+H]+
DATE: 2016.01.19 (Created 2011.04.04, modified 2011.06.20)
AUTHORS: Atsushi Yamamoto, PFOS.jp
LICENSE: CC BY-SA
COPYRIGHT: PFOS.jp
COMMENT: Disclaimer: While authors make an effort to ensure that the content of this record is accurate, the authors make no representations or warranties in relation to the accuracy or completeness of the record. This record do not reflect any viewpoints of the affiliation and organization to which the authors belong.

CH$NAME: 5-beta-Androstane-3-alpha,17-beta-diol
CH$NAME: Etiocholane-3-alpha,17-beta-diol
CH$COMPOUND_CLASS: Natural Product; Steroid hormone
CH$FORMULA: C19H32O2
CH$EXACT_MASS: 292.24023
CH$SMILES: OC(C4)CC([H])(C3)C(C)(C4)C(C2)C(C3)C(C1)C(C)(C2)C(O)C1
CH$IUPAC: InChI=1S/C19H32O2/c1-18-9-7-13(20)11-12(18)3-4-14-15-5-6-17(21)19(15,2)10-8-16(14)18/h12-17,20-21H,3-11H2,1-2H3/t12-,13-,14?,15?,16?,17+,18?,19?/m1/s1
CH$LINK: CAS 1851-23-6
CH$LINK: INCHIKEY CBMYJHIOYJEBSB-GCFMDFLISA-N

AC$INSTRUMENT: API2000
AC$INSTRUMENT_TYPE: LC-APPI-QQ
AC$MASS_SPECTROMETRY: MS_TYPE MS2
AC$MASS_SPECTROMETRY: ION_MODE POSITIVE
AC$CHROMATOGRAPHY: RETENTION_TIME 0.820867 min

MS$FOCUSED_ION: BASE_PEAK 257.299988
MS$FOCUSED_ION: PRECURSOR_M/Z 257.300000
MS$FOCUSED_ION: PRECURSOR_TYPE [M-2H2O+H]+

PK$SPLASH: splash10-0a4i-0590000000-19914236abc999802ed6
PK$NUM_PEAK: 196
PK$PEAK: m/z int. rel.int.
  41.199999 4051.500000 1
  42.400002 1350.500000 1
  42.599998 1350.500000 1
  43.199999 4051.500000 1
  51.400002 1350.500000 1
  52.750000 2701.000000 1
  53.799999 1350.500000 1
  54.299999 2701.000000 1
  55.135714 37814.000000 1
  55.500000 4051.500000 1
  56.599998 2701.000000 1
  56.933333 8103.000000 1
  57.500000 1350.500000 1
  63.599998 1350.500000 1
  65.149998 5402.000000 1
  66.099998 6752.500000 1
  66.986668 162060.000000 2
  69.066872 220131.500000 3
  70.250000 2701.000000 1
  70.699997 1350.500000 1
  70.900002 1350.500000 1
  71.199999 4051.500000 1
  76.599998 2701.000000 1
  76.900002 12154.500000 1
  77.224998 5402.000000 1
  77.500000 1350.500000 1
  77.699997 1350.500000 1
  78.099998 2701.000000 1
  79.070909 148555.000000 2
  79.930770 17556.500000 1
  81.107382 1573332.500000 21
  81.838891 24309.000000 1
  83.111455 1002071.000000 13
  84.000000 1350.500000 1
  84.350002 2701.000000 1
  84.699997 1350.500000 1
  84.900002 6752.500000 1
  86.900002 1350.500000 1
  88.500000 1350.500000 1
  89.099998 1350.500000 1
  89.300003 1350.500000 1
  89.500000 1350.500000 1
  89.699997 1350.500000 1
  91.026356 174214.500000 2
  92.099998 9453.500000 1
  93.106604 715765.000000 9
  95.058782 3060233.000000 41
  96.000000 5402.000000 1
  96.535294 22958.500000 1
  97.146667 121545.000000 2
  97.800003 1350.500000 1
  101.800003 1350.500000 1
  102.500000 1350.500000 1
  103.099998 6752.500000 1
  103.800003 8103.000000 1
  105.036749 764383.000000 10
  107.049831 1596291.000000 21
  109.101538 2809040.000000 37
  110.000000 5402.000000 1
  111.020000 135050.000000 2
  112.400002 2701.000000 1
  114.699997 1350.500000 1
  115.350002 2701.000000 1
  116.199997 2701.000000 1
  116.883335 16206.000000 1
  117.174998 21608.000000 1
  119.092396 710363.000000 9
  121.103891 2637526.500000 35
  123.071132 1300531.500000 17
  124.000000 2701.000000 1
  125.112500 64824.000000 1
  126.300003 1350.500000 1
  127.199997 1350.500000 1
  127.950001 2701.000000 1
  128.600006 1350.500000 1
  128.928569 9453.500000 1
  129.300003 5402.000000 1
  129.699997 1350.500000 1
  130.000000 1350.500000 1
  131.081052 128297.500000 2
  133.141184 1210048.000000 16
  135.130330 5111642.500000 68
  136.259998 13505.000000 1
  137.151968 171513.500000 2
  138.849998 2701.000000 1
  139.100006 2701.000000 1
  140.899994 2701.000000 1
  141.100006 2701.000000 1
  142.199997 2701.000000 1
  142.500000 1350.500000 1
  143.128573 18907.000000 1
  144.000000 8103.000000 1
  145.098709 418655.000000 6
  147.147047 6998291.000000 93
  149.145055 3249303.000000 43
  150.100006 5402.000000 1
  150.449997 2701.000000 1
  151.000000 8103.000000 1
  151.399994 5402.000000 1
  152.399994 1350.500000 1
  153.000000 1350.500000 1
  153.600006 1350.500000 1
  154.500000 1350.500000 1
  154.699997 4051.500000 1
  155.100006 1350.500000 1
  155.300003 1350.500000 1
  156.150002 2701.000000 1
  156.699997 1350.500000 1
  157.024998 10804.000000 1
  157.699997 1350.500000 1
  159.163543 388944.000000 5
  161.139103 7653283.500000 101
  163.199584 972360.000000 13
  165.174999 10804.000000 1
  165.800003 1350.500000 1
  166.399994 1350.500000 1
  166.800003 1350.500000 1
  168.500000 1350.500000 1
  168.924995 5402.000000 1
  170.250000 2701.000000 1
  170.771428 9453.500000 1
  171.199997 8103.000000 1
  171.800003 1350.500000 1
  172.500000 31061.500000 1
  173.187931 626632.000000 8
  175.171873 7298102.000000 97
  176.388887 24309.000000 1
  177.281816 103988.500000 1
  178.000000 1350.500000 1
  179.100006 2701.000000 1
  179.300003 1350.500000 1
  181.199997 1350.500000 1
  181.849998 2701.000000 1
  182.899994 6752.500000 1
  183.200005 10804.000000 1
  184.500000 1350.500000 1
  184.926663 20257.500000 1
  187.188469 1463942.000000 19
  189.226683 1103358.500000 15
  191.300003 6752.500000 1
  191.500000 5402.000000 1
  195.100006 1350.500000 1
  195.300003 1350.500000 1
  196.399994 1350.500000 1
  196.699997 1350.500000 1
  197.328574 18907.000000 1
  197.699997 2701.000000 1
  198.000000 4051.500000 1
  198.199997 1350.500000 1
  198.399994 4051.500000 1
  199.180554 48618.000000 1
  200.118182 44566.500000 1
  201.167325 3488341.500000 46
  202.199997 12154.500000 1
  202.600006 2701.000000 1
  202.962498 10804.000000 1
  203.600006 2701.000000 1
  207.000000 2701.000000 1
  209.349998 2701.000000 1
  210.100006 1350.500000 1
  210.899994 2701.000000 1
  211.374996 5402.000000 1
  213.218183 29711.000000 1
  215.222367 615828.000000 8
  216.199997 2701.000000 1
  220.899994 1350.500000 1
  221.300003 1350.500000 1
  223.849998 2701.000000 1
  224.100006 1350.500000 1
  224.399994 1350.500000 1
  225.218183 29711.000000 1
  225.600006 2701.000000 1
  226.600006 2701.000000 1
  227.150002 10804.000000 1
  227.500000 4051.500000 1
  227.699997 4051.500000 1
  229.273648 399748.000000 5
  236.899994 1350.500000 1
  238.199997 1350.500000 1
  239.334482 78329.000000 1
  240.100006 2701.000000 1
  240.399994 1350.500000 1
  241.000000 1350.500000 1
  242.307691 70226.000000 1
  247.800003 1350.500000 1
  251.100006 1350.500000 1
  251.849998 2701.000000 1
  252.100006 1350.500000 1
  252.500000 2701.000000 1
  253.399994 1350.500000 1
  253.800003 1350.500000 1
  254.000000 2701.000000 1
  254.399994 4051.500000 1
  254.625004 5402.000000 1
  257.325725 75469991.500000 999
  275.100006 1350.500000 1