ACCESSION: MSBNK-PFOS_research_group-FFF00189
RECORD_TITLE: Epiandrosterone; LC-APPI-QQ; MS2; CE:30 V; [M-2H2O+H]+
DATE: 2016.01.19 (Created 2011.04.05, modified 2011.06.20)
AUTHORS: Atsushi Yamamoto, PFOS.jp
LICENSE: CC BY-SA
COPYRIGHT: PFOS.jp
COMMENT: Disclaimer: While authors make an effort to ensure that the content of this record is accurate, the authors make no representations or warranties in relation to the accuracy or completeness of the record. This record do not reflect any viewpoints of the affiliation and organization to which the authors belong.

CH$NAME: Epiandrosterone
CH$NAME: 3-beta-Hydroxy-5alpha-androstan-17-one
CH$COMPOUND_CLASS: Natural Product; Steroid hormone
CH$FORMULA: C19H30O2
CH$EXACT_MASS: 290.22458
CH$SMILES: OC(C4)CC([H])(C3)C(C)(C4)C(C2)C(C3)C(C1)C(C)(C2)C(=O)C1
CH$IUPAC: InChI=1S/C19H30O2/c1-18-9-7-13(20)11-12(18)3-4-14-15-5-6-17(21)19(15,2)10-8-16(14)18/h12-16,20H,3-11H2,1-2H3/t12-,13-,14?,15?,16?,18?,19?/m0/s1
CH$LINK: CAS 481-29-8
CH$LINK: LIPIDBANK SST0205
CH$LINK: INCHIKEY QGXBDMJGAMFCBF-CYFBJHQBSA-N

AC$INSTRUMENT: API2000
AC$INSTRUMENT_TYPE: LC-APPI-QQ
AC$MASS_SPECTROMETRY: MS_TYPE MS2
AC$MASS_SPECTROMETRY: ION_MODE POSITIVE
AC$CHROMATOGRAPHY: RETENTION_TIME 0.820850 min

MS$FOCUSED_ION: BASE_PEAK 255.399994
MS$FOCUSED_ION: PRECURSOR_M/Z 255.300000
MS$FOCUSED_ION: PRECURSOR_TYPE [M-2H2O+H]+

PK$SPLASH: splash10-0a4j-2920000000-e9e8bbaaccc12f6e1895
PK$NUM_PEAK: 208
PK$PEAK: m/z int. rel.int.
  38.799999 2701.000000 1
  39.299999 1350.500000 1
  40.400000 4051.500000 1
  40.776471 22958.500000 1
  41.163635 14855.500000 1
  42.000000 1350.500000 1
  43.116666 32412.000000 1
  45.200001 1350.500000 1
  51.000000 2701.000000 1
  51.350000 2701.000000 1
  52.599998 1350.500000 1
  52.966667 8103.000000 1
  53.500000 8103.000000 1
  53.700001 1350.500000 1
  53.900002 4051.500000 1
  55.076142 532097.000000 16
  56.200001 5402.000000 1
  56.400002 2701.000000 1
  57.099998 32412.000000 1
  57.362501 21608.000000 1
  57.599998 2701.000000 1
  59.000000 1350.500000 1
  64.099998 1350.500000 1
  65.079412 45917.000000 1
  67.116802 2990007.000000 88
  69.157292 907536.000000 27
  70.199999 4051.500000 1
  70.500000 2701.000000 1
  70.800003 5402.000000 1
  71.049999 16206.000000 1
  71.649998 2701.000000 1
  71.900002 1350.500000 1
  73.199997 1350.500000 1
  75.000000 2701.000000 1
  75.199997 1350.500000 1
  75.400002 1350.500000 1
  75.699997 2701.000000 1
  76.000000 6752.500000 1
  77.061112 316017.000000 9
  79.044593 3646350.000000 107
  81.100904 12257138.000000 359
  83.115006 2466013.000000 72
  84.599998 4051.500000 1
  84.866669 8103.000000 1
  85.199997 6752.500000 1
  86.000000 1350.500000 1
  87.300003 1350.500000 1
  87.599998 1350.500000 1
  88.099998 5402.000000 1
  89.300003 9453.500000 1
  91.045197 4864501.000000 142
  93.102384 6345999.500000 186
  95.070694 8930856.500000 261
  96.383335 16206.000000 1
  97.091000 270100.000000 8
  99.599998 1350.500000 1
  100.549999 2701.000000 1
  101.000000 1350.500000 1
  101.840001 6752.500000 1
  103.096152 35113.000000 1
  103.300003 36463.500000 1
  105.040679 9866753.000000 289
  107.046382 7503378.000000 220
  109.090333 3604484.500000 105
  110.000000 5402.000000 1
  110.952501 54020.000000 2
  113.099998 1350.500000 1
  113.800003 4051.500000 1
  115.006154 87782.500000 3
  117.080374 2601063.000000 76
  119.076062 4547133.500000 133
  121.083950 4560638.500000 133
  123.084449 1493653.000000 44
  125.074999 5402.000000 1
  125.300003 5402.000000 1
  125.699997 2701.000000 1
  125.900002 1350.500000 1
  126.350002 2701.000000 1
  126.800003 8103.000000 1
  127.000000 6752.500000 1
  127.300003 10804.000000 1
  127.500000 8103.000000 1
  128.206121 132349.000000 4
  129.067447 1211398.500000 35
  131.129210 5229136.000000 153
  133.144103 4878006.000000 143
  135.128609 3134510.500000 92
  135.883329 8103.000000 1
  137.131406 163410.500000 5
  138.699997 1350.500000 1
  138.899994 1350.500000 1
  139.100006 1350.500000 1
  139.300003 1350.500000 1
  140.000000 4051.500000 1
  140.199997 1350.500000 1
  141.081250 43216.000000 1
  143.099705 2287747.000000 67
  145.106221 14500318.500000 424
  147.157465 9769517.000000 286
  149.141208 2012245.000000 59
  150.199997 1350.500000 1
  151.206779 159359.000000 5
  151.800003 1350.500000 1
  152.000000 5402.000000 1
  152.199997 2701.000000 1
  152.449997 5402.000000 1
  152.899994 2701.000000 1
  153.100006 1350.500000 1
  153.300003 1350.500000 1
  153.550003 2701.000000 1
  154.199997 6752.500000 1
  155.070690 78329.000000 2
  157.149665 2422797.000000 71
  159.143046 12643381.000000 370
  161.139008 10843164.500000 317
  163.176359 645539.000000 19
  164.250000 2701.000000 1
  164.600006 1350.500000 1
  164.899994 5402.000000 1
  165.399994 2701.000000 1
  165.849998 2701.000000 1
  166.399994 2701.000000 1
  166.800003 5402.000000 1
  167.150002 10804.000000 1
  168.199997 8103.000000 1
  169.129271 110741.000000 3
  171.096051 3146665.000000 92
  173.190314 10763485.000000 315
  175.175351 1928514.000000 56
  175.999998 10804.000000 1
  176.500000 8103.000000 1
  177.239147 348429.000000 10
  178.100006 1350.500000 1
  178.300003 1350.500000 1
  178.699997 1350.500000 1
  178.949997 2701.000000 1
  179.399994 1350.500000 1
  180.000000 2701.000000 1
  180.300003 5402.000000 1
  181.137503 10804.000000 1
  181.399994 5402.000000 1
  182.000000 9453.500000 1
  182.216665 16206.000000 1
  183.215625 172864.000000 5
  185.159204 6514812.000000 191
  187.183492 3975872.000000 116
  189.224860 2411993.000000 71
  190.000000 2701.000000 1
  192.300003 1350.500000 1
  192.949997 5402.000000 1
  193.266668 8103.000000 1
  193.500000 2701.000000 1
  193.800003 2701.000000 1
  194.000000 2701.000000 1
  194.399994 2701.000000 1
  194.600006 1350.500000 1
  194.899994 9453.500000 1
  196.199997 10804.000000 1
  197.226022 363284.500000 11
  199.204194 11013327.500000 322
  201.183030 2896822.500000 85
  202.083338 8103.000000 1
  202.600006 1350.500000 1
  204.000000 2701.000000 1
  207.100006 2701.000000 1
  207.550003 2701.000000 1
  208.000000 1350.500000 1
  208.550003 2701.000000 1
  208.974998 5402.000000 1
  209.216665 8103.000000 1
  209.500000 4051.500000 1
  209.699997 1350.500000 1
  210.199997 2701.000000 1
  211.101828 221482.000000 6
  213.229627 3181778.000000 93
  215.000000 1350.500000 1
  220.899994 1350.500000 1
  221.199997 1350.500000 1
  221.500000 1350.500000 1
  221.899994 2701.000000 1
  222.349998 2701.000000 1
  222.800003 16206.000000 1
  223.163637 29711.000000 1
  224.300003 4051.500000 1
  225.139364 126947.000000 4
  226.227778 437562.000000 13
  227.254298 1288377.000000 38
  236.699997 1350.500000 1
  237.179999 13505.000000 1
  238.000000 4051.500000 1
  238.300003 1350.500000 1
  238.600006 1350.500000 1
  238.825001 5402.000000 1
  239.200001 14855.500000 1
  239.500000 8103.000000 1
  240.298921 501035.500000 15
  241.000000 2701.000000 1
  244.199997 1350.500000 1
  248.899994 1350.500000 1
  250.899994 2701.000000 1
  251.199997 5402.000000 1
  251.699997 2701.000000 1
  252.150002 2701.000000 1
  252.800003 31061.500000 1
  253.328916 224183.000000 7
  255.316125 34136588.500000 999
  257.000000 1350.500000 1
  265.500000 1350.500000 1