ACCESSION: MSBNK-PFOS_research_group-FFF00253
RECORD_TITLE: Androsterone; LC-APPI-QQ; MS2; CE:40 V; [M-2H2O+H]+
DATE: 2016.01.19 (Created 2011.04.05, modified 2011.06.20)
AUTHORS: Atsushi Yamamoto, PFOS.jp
LICENSE: CC BY-SA
COPYRIGHT: PFOS.jp
COMMENT: Disclaimer: While authors make an effort to ensure that the content of this record is accurate, the authors make no representations or warranties in relation to the accuracy or completeness of the record. This record do not reflect any viewpoints of the affiliation and organization to which the authors belong.

CH$NAME: Androsterone
CH$COMPOUND_CLASS: Natural Product; Steroid hormone
CH$FORMULA: C19H30O2
CH$EXACT_MASS: 290.22458
CH$SMILES: OC(C4)CC([H])(C3)C(C)(C4)C(C2)C(C3)C(C1)C(C)(C2)C(=O)C1
CH$IUPAC: InChI=1S/C19H30O2/c1-18-9-7-13(20)11-12(18)3-4-14-15-5-6-17(21)19(15,2)10-8-16(14)18/h12-16,20H,3-11H2,1-2H3/t12-,13+,14?,15?,16?,18?,19?/m0/s1
CH$LINK: CAS 53-41-8
CH$LINK: LIPIDBANK SST0002
CH$LINK: INCHIKEY QGXBDMJGAMFCBF-LISVHTKMSA-N

AC$INSTRUMENT: API2000
AC$INSTRUMENT_TYPE: LC-APPI-QQ
AC$MASS_SPECTROMETRY: MS_TYPE MS2
AC$MASS_SPECTROMETRY: ION_MODE POSITIVE
AC$CHROMATOGRAPHY: RETENTION_TIME 0.820833 min

MS$FOCUSED_ION: BASE_PEAK 91.199997
MS$FOCUSED_ION: PRECURSOR_M/Z 255.300000
MS$FOCUSED_ION: PRECURSOR_TYPE [M-H2O+H]+

PK$SPLASH: splash10-05o4-5900000000-c9729f9aa730f729c3a7
PK$NUM_PEAK: 205
PK$PEAK: m/z int. rel.int.
  39.000000 4051.500000 1
  39.500000 1350.500000 1
  40.366667 8103.000000 1
  41.020833 64824.000000 6
  41.799999 2701.000000 1
  42.099998 2701.000000 1
  42.400002 6752.500000 1
  43.061842 102638.000000 10
  44.099998 1350.500000 1
  44.900002 1350.500000 1
  49.900002 2701.000000 1
  50.299999 2701.000000 1
  51.030000 13505.000000 1
  51.549999 5402.000000 1
  51.799999 1350.500000 1
  52.200001 1350.500000 1
  52.599998 2701.000000 1
  53.150000 21608.000000 2
  53.442858 18907.000000 2
  55.089967 1211398.500000 118
  56.049999 8103.000000 1
  56.299999 5402.000000 1
  56.958334 32412.000000 3
  57.400002 20257.500000 2
  57.900002 1350.500000 1
  58.500000 1350.500000 1
  59.000000 1350.500000 1
  59.299999 5402.000000 1
  62.099998 1350.500000 1
  63.099998 1350.500000 1
  63.599998 1350.500000 1
  63.900002 2701.000000 1
  64.973685 51319.000000 5
  67.105175 4123076.500000 402
  69.121566 1052039.500000 103
  70.000000 1350.500000 1
  70.500000 1350.500000 1
  71.057896 25659.500000 3
  71.699997 1350.500000 1
  72.699997 1350.500000 1
  73.500000 1350.500000 1
  74.199997 1350.500000 1
  74.850002 2701.000000 1
  75.500000 4051.500000 1
  75.699997 4051.500000 1
  77.089884 934546.000000 91
  79.051398 5507339.000000 537
  81.099286 9461603.000000 923
  83.127244 842712.000000 82
  84.099998 1350.500000 1
  84.599998 1350.500000 1
  85.250000 2701.000000 1
  86.599998 1350.500000 1
  86.900002 1350.500000 1
  87.099998 1350.500000 1
  87.599998 2701.000000 1
  87.900002 1350.500000 1
  88.300001 4051.500000 1
  91.059380 7141444.000000 696
  93.099791 6455390.000000 629
  95.070025 5577565.000000 544
  96.300003 4051.500000 1
  97.052380 56721.000000 6
  97.483334 16206.000000 2
  99.900002 2701.000000 1
  100.866666 8103.000000 1
  101.699997 4051.500000 1
  103.154500 270100.000000 26
  105.039942 10244893.000000 999
  107.055495 3969119.500000 387
  109.106406 1517962.000000 148
  110.099998 1350.500000 1
  110.300003 1350.500000 1
  110.699997 1350.500000 1
  111.049999 5402.000000 1
  111.500000 1350.500000 1
  112.000000 2701.000000 1
  113.500000 2701.000000 1
  115.078103 370037.000000 36
  117.105272 2510579.500000 245
  119.079553 4412083.500000 430
  121.106008 1393716.000000 136
  122.099998 5402.000000 1
  123.096907 261997.000000 26
  124.699997 1350.500000 1
  125.350002 2701.000000 1
  125.800003 5402.000000 1
  127.009524 56721.000000 6
  129.095016 1707032.000000 166
  131.132795 4426939.000000 432
  133.138966 2349870.000000 229
  135.123860 769785.000000 75
  135.949997 5402.000000 1
  136.500000 5402.000000 1
  137.187498 10804.000000 1
  137.399994 4051.500000 1
  139.250000 13505.000000 1
  139.550003 8103.000000 1
  139.800003 1350.500000 1
  140.050003 5402.000000 1
  141.190624 216080.000000 21
  143.085920 3184479.000000 311
  145.106602 7281896.000000 710
  147.141240 3006213.000000 293
  149.161413 496984.000000 48
  149.800003 2701.000000 1
  150.000000 1350.500000 1
  150.500000 1350.500000 1
  150.699997 4051.500000 1
  151.175003 10804.000000 1
  151.500000 4051.500000 1
  151.899994 2701.000000 1
  152.800003 8103.000000 1
  153.399994 8103.000000 1
  153.964284 18907.000000 2
  155.090961 239038.500000 23
  157.152414 2517332.000000 245
  159.136535 3430270.000000 334
  161.120851 2538940.000000 248
  163.181482 72927.000000 7
  164.300003 2701.000000 1
  164.800003 2701.000000 1
  165.100006 6752.500000 1
  165.800003 4051.500000 1
  166.300000 6752.500000 1
  167.067859 37814.000000 4
  168.194870 52669.500000 5
  169.113120 380841.000000 37
  171.106028 2016296.500000 197
  173.188120 2750968.500000 268
  174.139999 27010.000000 3
  175.182287 472675.000000 46
  176.199997 1350.500000 1
  176.399994 4051.500000 1
  176.849998 10804.000000 1
  177.342854 18907.000000 2
  177.899994 2701.000000 1
  178.800003 2701.000000 1
  179.166667 8103.000000 1
  179.399994 1350.500000 1
  179.600006 1350.500000 1
  180.100006 2701.000000 1
  180.699997 4051.500000 1
  181.037500 21608.000000 2
  182.106250 43216.000000 4
  183.187136 230935.500000 23
  185.151855 1929864.500000 188
  187.187168 915639.000000 89
  187.899994 9453.500000 1
  189.208334 210678.000000 21
  192.100006 1350.500000 1
  192.500000 1350.500000 1
  192.899994 5402.000000 1
  193.300003 4051.500000 1
  193.800003 1350.500000 1
  194.349998 5402.000000 1
  194.862497 21608.000000 2
  197.218750 302512.000000 29
  199.215593 3481589.000000 339
  200.173831 289007.000000 28
  201.210611 420005.500000 41
  202.699997 1350.500000 1
  203.000000 1350.500000 1
  204.300003 1350.500000 1
  207.399994 2701.000000 1
  208.050003 2701.000000 1
  208.500000 1350.500000 1
  209.300003 4051.500000 1
  209.899994 4051.500000 1
  210.166667 8103.000000 1
  211.131034 234987.000000 23
  212.247825 62123.000000 6
  213.219713 753579.000000 73
  214.202940 91834.000000 9
  214.899994 1350.500000 1
  215.199997 1350.500000 1
  219.100006 1350.500000 1
  221.000000 1350.500000 1
  221.899994 1350.500000 1
  222.500000 1350.500000 1
  223.087500 21608.000000 2
  224.199997 8103.000000 1
  225.250944 143153.000000 14
  226.169468 176915.500000 17
  227.217297 249842.500000 24
  236.800003 1350.500000 1
  237.500000 2701.000000 1
  238.000000 1350.500000 1
  238.199997 1350.500000 1
  239.200003 17556.500000 2
  239.500000 8103.000000 1
  240.326924 140452.000000 14
  241.000000 1350.500000 1
  251.000000 1350.500000 1
  251.600006 1350.500000 1
  252.299998 4051.500000 1
  253.257894 51319.000000 5
  253.600006 20257.500000 2
  253.899994 4051.500000 1
  255.329167 2204016.000000 215
  256.299988 1350.500000 1
  256.600006 1350.500000 1
  257.100006 1350.500000 1
  278.200012 1350.500000 1
  279.299988 1350.500000 1