ACCESSION: MSBNK-RIKEN-PR010031
RECORD_TITLE: D-(+)-Glucose; GC-EI-TOF; MS; 5 TMS; 1 MEOX; BP:73
DATE: 2016.01.19 (Created 2006.12.21, modified 2011.05.06)
AUTHORS: Kusano M, Fukushima A, Plant Science Center, RIKEN.
LICENSE: CC BY-SA

CH$NAME: D-(+)-Glucose
CH$NAME: Grape sugar
CH$NAME: Dextrose
CH$NAME: D-Glucose
CH$COMPOUND_CLASS: Natural Product
CH$FORMULA: C6H12O6
CH$EXACT_MASS: 180.06339
CH$SMILES: OC[C@@H](O1)[C@@H](O)[C@H](O)[C@@H](O)C(O)1
CH$IUPAC: InChI=1S/C6H12O6/c7-1-2-3(8)4(9)5(10)6(11)12-2/h2-11H,1H2/t2-,3-,4+,5-,6?/m1/s1
CH$LINK: CAS 50-99-7
CH$LINK: CHEBI 17634
CH$LINK: KEGG C00031
CH$LINK: NIKKAJI J4.109B
CH$LINK: PUBCHEM 3333
CH$LINK: INCHIKEY WQZGKKKJIJFFOK-GASJEMHNSA-N

AC$INSTRUMENT: Pegasus III TOF-MS system, Leco; GC 6890, Agilent Technologies
AC$INSTRUMENT_TYPE: GC-EI-TOF
AC$MASS_SPECTROMETRY: MS_TYPE MS
AC$MASS_SPECTROMETRY: ION_MODE POSITIVE
AC$CHROMATOGRAPHY: RETENTION_INDEX 1881.6
AC$CHROMATOGRAPHY: RETENTION_TIME 459.397 sec

MS$FOCUSED_ION: BASE_PEAK 73
MS$FOCUSED_ION: DERIVATIVE_FORM C22H55NO6Si5
MS$FOCUSED_ION: DERIVATIVE_MASS 569.28757
MS$FOCUSED_ION: DERIVATIVE_TYPE 5 TMS; 1 MEOX
MS$DATA_PROCESSING: WHOLE ChromaTOF ver. 2.32 (Leco)

PK$SPLASH: splash10-00di-9821000000-dbc697213e3b7cc9d4fe
PK$NUM_PEAK: 150
PK$PEAK: m/z int. rel.int.
  60 5 5
  61 7 7
  66 5 5
  67 4 4
  69 1 1
  70 4 4
  71 3 3
  72 17 17
  73 999 999
  74 86 86
  75 63 63
  76 5 5
  77 6 6
  81 1 1
  82 5 5
  83 14 14
  84 4 4
  85 4 4
  86 5 5
  87 5 5
  88 4 4
  89 59 59
  90 5 5
  91 2 2
  97 2 2
  98 1 1
  99 4 4
  100 13 13
  101 16 16
  102 9 9
  103 117 117
  104 12 12
  105 26 26
  106 2 2
  107 1 1
  110 1 1
  111 2 2
  112 1 1
  113 3 3
  114 11 11
  115 7 7
  116 6 6
  117 78 78
  118 8 8
  119 8 8
  126 1 1
  127 3 3
  128 3 3
  129 98 98
  130 18 18
  131 23 23
  132 4 4
  133 53 53
  134 7 7
  135 4 4
  141 1 1
  142 4 4
  143 12 12
  144 2 2
  145 6 6
  146 1 1
  147 247 247
  148 38 38
  149 24 24
  150 2 2
  151 1 1
  155 1 1
  156 1 1
  157 67 67
  158 12 12
  159 5 5
  160 123 123
  161 22 22
  162 6 6
  163 7 7
  164 1 1
  168 1 1
  169 1 1
  170 1 1
  172 3 3
  173 3 3
  174 1 1
  175 3 3
  176 1 1
  177 3 3
  186 2 2
  187 1 1
  188 1 1
  189 22 22
  190 6 6
  191 11 11
  192 2 2
  193 1 1
  200 1 1
  201 7 7
  202 2 2
  203 3 3
  204 23 23
  205 159 159
  206 31 31
  207 16 16
  208 2 2
  210 2 2
  215 2 2
  216 6 6
  217 73 73
  218 15 15
  219 7 7
  220 1 1
  221 5 5
  222 1 1
  229 19 19
  230 6 6
  231 8 8
  232 3 3
  233 5 5
  234 2 2
  235 1 1
  243 1 1
  244 2 2
  245 1 1
  246 2 2
  247 1 1
  256 1 1
  262 3 3
  263 1 1
  268 1 1
  269 1 1
  270 1 1
  274 3 3
  275 1 1
  276 1 1
  277 4 4
  278 1 1
  291 6 6
  292 1 1
  293 1 1
  300 1 1
  305 4 4
  306 1 1
  307 3 3
  308 1 1
  318 1 1
  319 123 123
  320 37 37
  321 18 18
  322 3 3
  364 2 2
  365 1 1
  374 1 1