ACCESSION: MSBNK-RIKEN-PR010075
RECORD_TITLE: trans-4-Hydroxy-L-proline; GC-EI-TOF; MS; 3 TMS; BP:73
DATE: 2016.01.19 (Created 2006.12.21, modified 2011.05.06)
AUTHORS: Kusano M, Fukushima A, Plant Science Center, RIKEN.
LICENSE: CC BY-SA

CH$NAME: trans-4-Hydroxy-L-proline
CH$NAME: 4-Hydroxy-L-proline
CH$NAME: L-Hydroxyproline
CH$COMPOUND_CLASS: Natural Product
CH$FORMULA: C5H9NO3
CH$EXACT_MASS: 131.05824
CH$SMILES: [H]C(O)(C1)CC([H])(N1)C(O)=O
CH$IUPAC: InChI=1S/C5H9NO3/c7-3-1-4(5(8)9)6-2-3/h3-4,6-7H,1-2H2,(H,8,9)/t3-,4+/m1/s1
CH$LINK: CAS 51-35-4
CH$LINK: CHEBI 18240
CH$LINK: KEGG C01015
CH$LINK: NIKKAJI J148.015D
CH$LINK: PUBCHEM 4260
CH$LINK: INCHIKEY PMMYEEVYMWASQN-DMTCNVIQSA-N
CH$LINK: COMPTOX DTXSID10883225

AC$INSTRUMENT: Pegasus III TOF-MS system, Leco; GC 6890, Agilent Technologies
AC$INSTRUMENT_TYPE: GC-EI-TOF
AC$MASS_SPECTROMETRY: MS_TYPE MS
AC$MASS_SPECTROMETRY: ION_MODE POSITIVE
AC$CHROMATOGRAPHY: RETENTION_INDEX 1516.5
AC$CHROMATOGRAPHY: RETENTION_TIME 375.922 sec

MS$FOCUSED_ION: BASE_PEAK 73
MS$FOCUSED_ION: DERIVATIVE_FORM C14H33NO3Si3
MS$FOCUSED_ION: DERIVATIVE_MASS 347.17682
MS$FOCUSED_ION: DERIVATIVE_TYPE 3 TMS
MS$DATA_PROCESSING: WHOLE ChromaTOF ver. 2.32 (Leco)

PK$SPLASH: splash10-00di-9530000000-00db00b15ab5341d7d64
PK$NUM_PEAK: 117
PK$PEAK: m/z int. rel.int.
  60 9 9
  61 18 18
  62 1 1
  63 2 2
  66 6 6
  67 6 6
  68 7 7
  69 5 5
  70 7 7
  71 8 8
  72 25 25
  73 999 999
  74 88 88
  75 120 120
  76 10 10
  77 17 17
  78 1 1
  79 3 3
  80 1 1
  81 1 1
  82 2 2
  83 8 8
  84 6 6
  85 9 9
  86 10 10
  87 5 5
  88 1 1
  89 4 4
  93 1 1
  94 2 2
  95 1 1
  96 3 3
  97 3 3
  98 5 5
  99 7 7
  100 24 24
  101 18 18
  102 6 6
  103 8 8
  104 1 1
  105 3 3
  108 1 1
  110 1 1
  111 3 3
  112 5 5
  113 8 8
  114 4 4
  115 8 8
  116 6 6
  117 9 9
  118 1 1
  119 5 5
  124 12 12
  125 2 2
  126 4 4
  127 1 1
  128 3 3
  129 14 14
  130 3 3
  131 18 18
  132 4 4
  133 36 36
  134 5 5
  135 3 3
  138 2 2
  139 5 5
  140 428 428
  141 59 59
  142 43 43
  143 6 6
  144 1 1
  145 1 1
  147 91 91
  148 14 14
  149 12 12
  150 1 1
  152 1 1
  156 4 4
  157 1 1
  158 10 10
  159 2 2
  166 1 1
  170 5 5
  171 1 1
  172 4 4
  173 1 1
  174 1 1
  175 3 3
  176 1 1
  177 1 1
  182 1 1
  187 2 2
  188 9 9
  189 3 3
  190 1 1
  191 1 1
  198 1 1
  200 1 1
  203 1 1
  214 11 11
  215 2 2
  216 3 3
  218 1 1
  228 3 3
  229 2 2
  230 433 433
  231 99 99
  232 41 41
  233 6 6
  234 1 1
  240 1 1
  304 14 14
  305 4 4
  306 2 2
  332 9 9
  333 3 3
  334 1 1