ACCESSION: MSBNK-RIKEN-PR030009
RECORD_TITLE: L-Histidine; CE-ESI-TOF; MS; [M+H]+
DATE: 2016.01.19 (Created 2007.05.08, modified 2011.05.06)
AUTHORS: Oikawa A, Plant Science Center, RIKEN.
LICENSE: CC BY-SA

CH$NAME: L-Histidine
CH$NAME: (S)-alpha-Amino-1H-imidazole-4-propionic acid
CH$COMPOUND_CLASS: N/A
CH$FORMULA: C6H9N3O2
CH$EXACT_MASS: 155.06948
CH$SMILES: C1=C(NC=N1)C[C@@H](C(=O)O)N
CH$IUPAC: InChI=1S/C6H9N3O2/c7-5(6(10)11)1-4-2-8-3-9-4/h2-3,5H,1,7H2,(H,8,9)(H,10,11)/t5-/m0/s1
CH$LINK: CAS 71-00-1
CH$LINK: CHEBI 15971
CH$LINK: CHEMPDB HIS
CH$LINK: KEGG C00135
CH$LINK: NIKKAJI J4.881J
CH$LINK: PUBCHEM 3435
CH$LINK: INCHIKEY HNDVDQJCIGZPNO-YFKPBYRVSA-N
CH$LINK: COMPTOX DTXSID9023126

AC$INSTRUMENT: CE-system connected to 6210 Time-of-Flight MS, Agilent
AC$INSTRUMENT_TYPE: CE-ESI-TOF
AC$MASS_SPECTROMETRY: MS_TYPE MS
AC$MASS_SPECTROMETRY: ION_MODE POSITIVE
AC$MASS_SPECTROMETRY: DRY_GAS_FLOW 7 L/min
AC$MASS_SPECTROMETRY: DRY_GAS_TEMP 300 C
AC$MASS_SPECTROMETRY: FRAGMENT_VOLTAGE 110 V
AC$MASS_SPECTROMETRY: IONIZATION ESI
AC$MASS_SPECTROMETRY: NEBULIZER 0/10/10 psig
AC$MASS_SPECTROMETRY: OCTPOLE_VOLTAGE 160 V
AC$MASS_SPECTROMETRY: SCANNING_CYCLE 1.5 cycle/sec
AC$MASS_SPECTROMETRY: SCANNING_RANGE m/z 50-1000
AC$MASS_SPECTROMETRY: SKIMMER_VOLTAGE 50 V
AC$CHROMATOGRAPHY: ANALYTICAL_TIME 30 min
AC$CHROMATOGRAPHY: CAPILLARY_VOLTAGE 4000 V
AC$CHROMATOGRAPHY: COLUMN_NAME Fused sillica capillary id=50 um L=100 cm (HMT Inc., Tsuruoka, Japan)
AC$CHROMATOGRAPHY: COLUMN_TEMPERATURE 20 C
AC$CHROMATOGRAPHY: FLOW_RATE 10 uL/min
AC$CHROMATOGRAPHY: INTERNAL_STANDARD 1. 200 uM Methionine sulfone, 2. 200 uM 3-Aminopyrrolidine
AC$CHROMATOGRAPHY: INTERNAL_STANDARD_MT 1. 16.89 min, 2. 6.45 min
AC$CHROMATOGRAPHY: MIGRATION_TIME 10.57 min
AC$CHROMATOGRAPHY: PRECONDITIONING 4 min
AC$CHROMATOGRAPHY: RUNNING_BUFFER 1 M Formic acid
AC$CHROMATOGRAPHY: RUNNING_VOLTAGE 30 kV
AC$CHROMATOGRAPHY: SAMPLE_INJECTION 15 sec 50 mbar
AC$CHROMATOGRAPHY: SHEATH_LIQUID Methanol-water (50% v/v) containing 0.5 uM reserpine
AC$CHROMATOGRAPHY: TIME_PROGRAM 0/0.25/1 min
AC$CHROMATOGRAPHY: WASHING_BUFFER 1 M Formic acid

MS$FOCUSED_ION: ION_TYPE [M+H]+
MS$DATA_PROCESSING: WHOLE Analyst QS 1.1

PK$SPLASH: splash10-0a4i-0900000000-dac9566873944f51ac90
PK$NUM_PEAK: 1
PK$PEAK: m/z int. rel.int.
  156.0749 168695.6 999