ACCESSION: MSBNK-RIKEN_NPDepo-CB000005
RECORD_TITLE: Cryptopine; LC-ESI-QQQ; MS; [M+H]+
DATE: 2018.04.04
AUTHORS: Nogawa T, Okano A, CSRS, RIKEN
LICENSE: CC BY
COMMENT: Origin: Plant
COMMENT: SubCategory_DNP: Alkaloids derived from anthranilic acid, Cryptolepine-type alkaloids

CH$NAME: Cryptopine
CH$COMPOUND_CLASS: Alkaloids
CH$FORMULA: C21H23NO5
CH$EXACT_MASS: 369.4212
CH$SMILES: COc1cc2c(cc1OC)C(=O)Cc1ccc3c(c1CN(C)CC2)OCO3
CH$IUPAC: InChI=1S/C21H23NO5/c1-22-7-6-14-9-19(24-2)20(25-3)10-15(14)17(23)8-13-4-5-18-21(16(13)11-22)27-12-26-18/h4-5,9-10H,6-8,11-12H2,1-3H3
CH$LINK: CAS 482-74-6
CH$LINK: CHEMSPIDER 65491
CH$LINK: INCHIKEY XPOJSWHIKCNLEQ-UHFFFAOYSA-N
CH$LINK: COMPTOX DTXSID40197463
CH$LINK: PUBCHEM CID:72616

AC$INSTRUMENT: ABSciex API3200 LC/MS system
AC$INSTRUMENT_TYPE: LC-ESI-QQQ
AC$MASS_SPECTROMETRY: MS_TYPE MS
AC$MASS_SPECTROMETRY: ION_MODE POSITIVE

MS$FOCUSED_ION: PRECURSOR_TYPE [M+H]+

PK$SPLASH: splash10-01b9-0019000000-817ed139dffb7b1a5380
PK$NUM_PEAK: 92
PK$PEAK: m/z int. rel.int.
  135.0000 485534.7500 75
  149.0000 161511.6094 24
  164.4000 211515.1094 32
  164.5000 319522.7813 49
  164.6000 477784.1250 74
  164.7000 646296.1875 100
  164.8000 815058.1875 127
  164.9000 520037.1563 81
  165.0000 601542.9375 93
  165.1000 687549.1875 107
  165.2000 654546.8750 102
  165.3000 361275.7813 55
  165.4000 506036.1250 78
  165.5000 219765.7031 33
  189.6000 302021.5938 46
  189.7000 203764.5313 31
  189.8000 209264.9531 32
  189.9000 239017.0938 36
  190.0000 273769.5625 42
  190.1000 198014.1563 30
  203.5000 221265.7969 33
  203.6000 354025.2500 54
  203.7000 415279.6875 64
  203.8000 589292.1250 91
  203.9000 737302.7500 115
  204.0000 857561.3125 134
  204.1000 856311.1250 134
  204.2000 727802.0625 113
  204.3000 917315.5000 143
  204.4000 880312.8750 137
  204.5000 624044.5000 97
  204.6000 577041.1875 89
  204.7000 510286.4375 79
  204.8000 625294.6250 97
  204.9000 659047.1250 102
  205.0000 691299.3125 108
  205.1000 659547.1875 103
  205.2000 463783.1250 72
  205.3000 457782.7188 71
  205.4000 478534.1875 74
  205.5000 196264.0313 29
  205.8000 178262.7031 27
  205.9000 144010.2813 21
  206.0000 156261.1406 23
  206.5000 165011.7656 25
  221.6000 181012.9375 27
  221.8000 147760.5625 22
  222.0000 151760.8281 22
  222.4000 159511.3906 24
  290.5000 395528.2813 61
  320.6000 150510.7656 22
  320.9000 158261.2969 23
  321.1000 172512.3281 26
  338.6000 404028.8750 62
  351.7000 185513.2656 28
  351.8000 200014.2813 30
  351.9000 234016.7188 35
  352.0000 150760.7813 22
  352.1000 214265.2969 32
  352.2000 144760.3438 21
  369.3000 716051.1250 111
  369.4000 2426673.5000 381
  369.5000 4660333.0000 733
  369.6000 5826416.0000 917
  369.7000 6124937.5000 964
  369.8000 6261447.5000 986
  369.9000 6179441.5000 973
  370.0000 6341203.0000 999
  370.1000 6081685.0000 958
  370.2000 5807414.0000 914
  370.3000 5089613.5000 801
  370.4000 5367883.5000 845
  370.5000 3084220.2500 485
  370.6000 2348417.7500 369
  370.7000 2383170.2500 374
  370.8000 2497928.5000 392
  370.9000 2129652.2500 334
  371.0000 2453925.2500 385
  371.1000 2615686.7500 411
  371.2000 1942638.6250 305
  371.3000 1982641.5000 311
  371.4000 1477105.6250 231
  371.5000 637545.6250 99
  371.6000 461532.9375 71
  371.7000 573540.9375 89
  371.8000 411279.4063 63
  371.9000 468033.4375 72
  372.0000 429280.6563 66
  372.1000 413029.5000 64
  372.2000 467533.4375 72
  372.3000 299771.3125 46
  372.4000 310522.2188 47