ACCESSION: MSBNK-RIKEN_NPDepo-CB000019
RECORD_TITLE: Cinchonine; LC-ESI-QQQ; MS; [M+H]+
DATE: 2018.04.04
AUTHORS: Nogawa T, Okano A, CSRS, RIKEN
LICENSE: CC BY
COMMENT: Origin: Plant
COMMENT: Formula(Parent): C19H22N2O
COMMENT: Bottle Name:Cinchonine
COMMENT: PRIME Parent Name:Cinchonine
COMMENT: PRIME in-house No.:V0325
COMMENT: SubCategory_DNP: Alkaloids derived from anthranilic acid, Quinoline alkaloids

CH$NAME: (1R)((5R)-5-vinylquinuclidin-2-yl)-4-quinolylmethan-1-ol
CH$NAME: Cinchonan-9-ol
CH$NAME: alpha-4-Quinolyl(5-vinyl-1-azabicyclo(2.2.2)oct-2-yl)methanol
CH$NAME: Cinchonine
CH$COMPOUND_CLASS: Alkaloids
CH$FORMULA: C19H22N2O
CH$EXACT_MASS: 294.4
CH$SMILES: C=C[C@H]1CN2CC[C@H]1C[C@@H]2[C@H](C3=CC=NC4=CC=CC=C34)O
CH$IUPAC: InChI=1S/C19H22N2O/c1-2-13-12-21-10-8-14(13)11-18(21)19(22)16-7-9-20-17-6-4-3-5-15(16)17/h2-7,9,13-14,18-19,22H,1,8,10-12H2/t13-,14-,18+,19-/m0/s1
CH$LINK: CAS 118-10-5
CH$LINK: CHEMSPIDER 81667
CH$LINK: INCHIKEY KMPWYEUPVWOPIM-QAMTZSDWSA-N
CH$LINK: PUBCHEM CID:90454

AC$INSTRUMENT: ABSciex API3200 LC/MS system
AC$INSTRUMENT_TYPE: LC-ESI-QQQ
AC$MASS_SPECTROMETRY: MS_TYPE MS
AC$MASS_SPECTROMETRY: ION_MODE POSITIVE

MS$FOCUSED_ION: PRECURSOR_TYPE [M+H]+

PK$SPLASH: splash10-0002-0950000000-3af6d0b9168c19915742
PK$NUM_PEAK: 163
PK$PEAK: m/z int. rel.int.
  100.0000 141824.9688 28
  100.2000 143380.5938 28
  100.5000 140269.3125 27
  100.8000 134824.5781 26
  108.1000 108378.1016 21
  108.6000 110970.9063 21
  108.7000 111748.7266 21
  109.0000 199643.8906 39
  109.1000 197569.6719 39
  109.2000 155048.0938 30
  109.3000 121860.5625 24
  119.0000 150381.0938 29
  121.7000 123934.7969 24
  121.8000 111748.7266 21
  122.0000 168271.2656 33
  128.6000 136898.6719 27
  128.7000 111489.4609 21
  128.8000 213385.6250 42
  128.9000 190828.4531 38
  129.0000 152714.5938 30
  129.1000 110193.0703 21
  129.2000 128083.2109 25
  129.3000 135083.7188 26
  129.4000 404214.0313 81
  129.5000 711976.8125 145
  129.6000 821651.3750 167
  129.7000 953623.8125 194
  129.8000 896582.5625 182
  129.9000 987848.2500 201
  130.0000 1015072.5000 207
  130.1000 820095.6250 167
  130.2000 817502.8125 166
  130.3000 689160.3125 140
  130.4000 563929.1250 114
  130.5000 269908.1250 54
  130.6000 128861.0313 25
  130.8000 148566.1719 29
  131.0000 185902.1875 37
  135.5000 115119.3516 22
  135.6000 156863.0469 31
  135.7000 129638.8750 25
  135.9000 170086.2188 33
  136.1000 112526.5469 22
  136.2000 128601.7578 25
  136.5000 116415.7266 22
  147.3000 242424.7031 48
  147.4000 1816759.5000 371
  147.5000 3289457.5000 674
  147.6000 3496360.7500 716
  147.7000 4126924.0000 845
  147.8000 4364163.5000 894
  147.9000 4661814.0000 955
  148.0000 4559918.0000 934
  148.1000 4873126.0000 999
  148.2000 4462948.5000 914
  148.3000 4093996.5000 839
  148.4000 3854164.0000 789
  148.5000 2479991.5000 507
  148.6000 1336317.5000 273
  148.7000 1455585.6250 297
  148.8000 832541.0000 169
  148.9000 790278.8125 161
  149.0000 431697.5000 87
  149.1000 228682.9688 45
  153.8000 135342.9844 26
  154.3000 127564.6719 25
  157.4000 229979.3750 46
  157.5000 333949.7813 67
  157.6000 479663.9375 97
  157.7000 550446.7500 111
  157.8000 476552.6250 96
  157.9000 396694.9688 80
  158.0000 469033.4375 95
  158.1000 437142.3750 88
  158.2000 368174.4063 74
  158.3000 315541.0625 63
  158.4000 828651.8125 169
  158.5000 1128895.3750 230
  158.6000 1294833.2500 264
  158.7000 1589113.6250 325
  158.8000 1482550.3750 303
  158.9000 1724975.0000 352
  159.0000 1530516.7500 313
  159.1000 1374690.7500 281
  159.2000 1231050.7500 251
  159.3000 1249200.3750 255
  159.4000 1078077.1250 220
  159.5000 578189.4375 117
  159.6000 389953.8125 79
  159.7000 403695.5000 81
  159.8000 453736.1563 92
  159.9000 311651.8438 62
  160.0000 498850.3438 101
  160.1000 514407.1563 104
  160.2000 311651.8750 62
  160.3000 418992.9375 84
  160.4000 337838.9063 68
  160.5000 154529.5625 30
  167.9000 130157.4531 25
  168.0000 238794.8438 48
  168.1000 116415.7266 22
  168.2000 164122.8281 32
  168.3000 174234.6719 34
  168.4000 141306.3750 27
  168.5000 159715.1250 31
  168.6000 253573.6406 51
  168.7000 222719.5938 44
  168.8000 199384.6094 39
  168.9000 138713.5938 27
  169.0000 122638.3750 24
  169.8000 139750.7188 27
  186.4000 376730.6563 76
  186.5000 597376.0000 121
  186.6000 662973.2500 135
  186.7000 658824.8125 134
  186.8000 762017.2500 155
  186.9000 757609.7500 154
  187.0000 603598.7500 122
  187.1000 532297.1250 108
  187.2000 511036.5625 103
  187.3000 558743.6250 113
  187.4000 457366.0313 92
  187.5000 206385.1250 41
  187.6000 118230.6641 23
  276.5000 166456.3281 33
  276.6000 162307.8594 32
  276.7000 236202.0781 47
  276.8000 260055.6250 52
  276.9000 321763.7188 65
  277.0000 285724.1250 57
  277.1000 271982.3438 54
  277.2000 193161.9375 38
  277.3000 236720.6250 47
  277.4000 218571.1563 43
  294.4000 707828.2500 144
  294.5000 2574109.7500 527
  294.6000 3407688.2500 698
  294.7000 3840681.7500 787
  294.8000 4036955.0000 827
  294.9000 4066772.2500 833
  295.0000 4251896.5000 871
  295.1000 3828755.2500 784
  295.2000 4109033.5000 842
  295.3000 3231120.0000 662
  295.4000 3678633.0000 753
  295.5000 2666931.0000 546
  295.6000 1827130.7500 373
  295.7000 1675712.3750 342
  295.8000 1456104.0000 297
  295.9000 1354726.2500 276
  296.0000 1424212.8750 291
  296.1000 1420323.6250 290
  296.2000 1222494.7500 249
  296.3000 964254.0000 196
  296.4000 1097263.6250 224
  296.5000 622266.6250 126
  296.6000 289613.2813 58
  296.7000 257462.8125 51
  296.9000 141047.1094 27
  297.0000 221941.8125 44
  297.1000 208977.8594 41
  297.2000 172679.0156 34
  312.4000 116156.4219 22