ACCESSION: MSBNK-RIKEN_NPDepo-CB000036
RECORD_TITLE: Oxymatrine; LC-ESI-QQQ; MS; [M+H]+
DATE: 2018.04.04
AUTHORS: Nogawa T, Okano A, CSRS, RIKEN
LICENSE: CC BY
COMMENT: Origin: Plant
COMMENT: SubCategory_DNP: Alkaloids derived from lysine, Quinolizidine alkaloids, Sophora alkaloid

CH$NAME: Oxymatrine
CH$COMPOUND_CLASS: Alkaloids
CH$FORMULA: C15H24N2O2
CH$EXACT_MASS: 264.3707
CH$SMILES: O=C1CCC[C@@H]2[C@H]3CCC[N+]4([O-])CCC[C@@H](CN12)[C@@H]34
CH$IUPAC: InChI=1S/C15H24N2O2/c18-14-7-1-6-13-12-5-3-9-17(19)8-2-4-11(15(12)17)10-16(13)14/h11-13,15H,1-10H2/t11-,12+,13+,15-,17?/m0/s1
CH$LINK: CAS 16837-52-8
CH$LINK: CHEMSPIDER 102808
CH$LINK: INCHIKEY XVPBINOPNYFXID-LHDUFFHYSA-N
CH$LINK: COMPTOX DTXSID40937482
CH$LINK: PUBCHEM CID:114850

AC$INSTRUMENT: ABSciex API3200 LC/MS system
AC$INSTRUMENT_TYPE: LC-ESI-QQQ
AC$MASS_SPECTROMETRY: MS_TYPE MS
AC$MASS_SPECTROMETRY: ION_MODE POSITIVE

MS$FOCUSED_ION: PRECURSOR_TYPE [M+H]+

PK$SPLASH: splash10-02t9-0090000000-8a4f54066f37f7532993
PK$NUM_PEAK: 72
PK$PEAK: m/z int. rel.int.
  147.6000 205691.1719 22
  147.7000 238017.0313 26
  147.8000 225045.5156 24
  147.9000 237399.3438 26
  148.0000 271990.0313 30
  148.1000 249135.4219 27
  148.2000 198278.8750 21
  148.8000 211559.3281 23
  149.7000 209294.3594 22
  204.6000 235855.0781 25
  204.7000 227825.1094 25
  204.8000 274254.9063 30
  204.9000 233899.0938 25
  205.0000 227825.1406 25
  205.1000 274460.8125 30
  205.2000 245841.0781 27
  205.3000 215162.4531 23
  205.4000 216706.7188 23
  221.1000 239973.0313 26
  246.5000 247488.2656 27
  246.6000 367114.4688 41
  246.7000 371747.1875 41
  246.8000 449679.2188 50
  246.9000 407779.1563 45
  247.0000 503727.1875 56
  247.1000 408396.8438 45
  247.2000 503315.3750 56
  247.3000 407985.0313 45
  247.4000 879180.4375 99
  247.5000 610072.9375 68
  247.6000 272195.9375 30
  247.7000 268489.8125 29
  247.8000 223192.4531 24
  247.9000 202396.8438 22
  248.0000 236678.6875 26
  248.1000 235443.3281 25
  248.2000 227619.2188 25
  248.3000 202602.7344 22
  248.4000 222059.9844 24
  264.3000 261798.1250 28
  264.4000 2385009.0000 271
  264.5000 6323408.5000 722
  264.6000 7928787.0000 906
  264.7000 8586319.0000 981
  264.8000 8405954.0000 960
  264.9000 8396895.0000 959
  265.0000 8434676.0000 964
  265.1000 8496343.0000 971
  265.2000 8287358.0000 947
  265.3000 8304960.5000 949
  265.4000 8738787.0000 999
  265.5000 6538365.0000 747
  265.6000 3903294.0000 445
  265.7000 3656422.7500 417
  265.8000 2988184.5000 340
  265.9000 3222289.5000 367
  266.0000 3135813.0000 357
  266.1000 3177403.7500 362
  266.2000 2975007.0000 339
  266.3000 2956681.7500 337
  266.4000 3086294.5000 352
  266.5000 2146477.0000 244
  266.6000 971422.4375 110
  266.7000 646825.6875 73
  266.8000 483858.1250 54
  266.9000 463680.2188 52
  267.0000 500329.9375 56
  267.1000 465224.4688 52
  267.2000 419515.3125 47
  267.3000 407573.2813 45
  267.4000 369070.4688 41
  267.5000 250267.8750 27