ACCESSION: MSBNK-RIKEN_NPDepo-CB000042
RECORD_TITLE: Heliotrine; LC-ESI-QQQ; MS; [M+H]+
DATE: 2018.04.04
AUTHORS: Nogawa T, Okano A, CSRS, RIKEN
LICENSE: CC BY
COMMENT: Origin: Plant
COMMENT: SubCategory_DNP: Alkaloids derived from ornithine, Pyrrolizidine alkaloids

CH$NAME: Heliotrine
CH$COMPOUND_CLASS: Alkaloids
CH$FORMULA: C16H27NO5
CH$EXACT_MASS: 313.3973
CH$SMILES: COC(C)C(O)(C(=O)OCC1=CCN2CCC(O)[C@@H]12)C(C)C
CH$IUPAC: InChI=1S/C16H27NO5/c1-10(2)16(20,11(3)21-4)15(19)22-9-12-5-7-17-8-6-13(18)14(12)17/h5,10-11,13-14,18,20H,6-9H2,1-4H3/t11?,13?,14-,16?/m1/s1
CH$LINK: CAS 303-33-3
CH$LINK: CHEMSPIDER 8977 792587 184640
CH$LINK: INCHIKEY LMFKRLGHEKVMNT-XUKJDLPSSA-N
CH$LINK: PUBCHEM CID:44654813

AC$INSTRUMENT: ABSciex API3200 LC/MS system
AC$INSTRUMENT_TYPE: LC-ESI-QQQ
AC$MASS_SPECTROMETRY: MS_TYPE MS
AC$MASS_SPECTROMETRY: ION_MODE POSITIVE

MS$FOCUSED_ION: PRECURSOR_TYPE [M+H]+

PK$SPLASH: splash10-03di-0409000000-5fdcf7f93885c3f1b5c2
PK$NUM_PEAK: 80
PK$PEAK: m/z int. rel.int.
  119.4000 615366.5625 61
  119.7000 308022.0000 30
  119.8000 495454.8125 48
  119.9000 417545.9375 41
  120.0000 510359.0313 50
  120.1000 581719.0000 57
  120.2000 427256.2500 42
  120.3000 533618.7500 52
  120.4000 390673.0938 38
  120.5000 269180.5000 26
  137.4000 1031557.5625 102
  137.5000 3173259.2500 318
  137.6000 4294467.5000 431
  137.7000 4933545.5000 496
  137.8000 4734370.0000 476
  137.9000 4852476.0000 487
  138.0000 4651720.0000 467
  138.1000 4334664.0000 435
  138.2000 4475126.5000 449
  138.3000 4244787.5000 426
  138.4000 4253820.5000 427
  138.5000 7179578.0000 722
  138.6000 1196633.8750 119
  138.9000 250888.8906 24
  139.1000 302150.5938 29
  139.2000 377123.7500 36
  139.3000 357702.9688 35
  139.4000 308247.7813 30
  139.5000 365380.9063 35
  155.5000 399706.0000 39
  155.6000 868965.3125 86
  155.7000 800992.6875 79
  155.8000 815671.1875 81
  155.9000 919323.7500 91
  156.0000 1067915.0000 106
  156.1000 759667.1250 75
  156.2000 892450.8125 88
  156.3000 794218.0000 79
  156.4000 785862.5625 78
  156.5000 287923.7813 28
  313.4000 3863147.5000 388
  313.5000 9108329.0000 916
  313.6000 9710145.0000 977
  313.7000 9842705.0000 990
  313.8000 9485901.0000 954
  313.9000 9328957.0000 938
  314.0000 9578715.0000 964
  314.1000 9924675.0000 999
  314.2000 9773149.0000 983
  314.3000 9257370.0000 931
  314.4000 7942857.5000 799
  314.5000 6311289.0000 634
  314.6000 5478004.0000 550
  314.7000 4972388.0000 500
  314.8000 1545529.7500 154
  314.9000 3141643.2500 315
  315.0000 3274878.5000 328
  315.1000 3494152.7500 351
  315.2000 3625130.5000 364
  315.3000 3282105.5000 329
  315.4000 3109802.5000 312
  315.5000 2502565.7500 251
  315.6000 1075141.3750 107
  315.7000 872578.4375 86
  315.8000 747924.4375 74
  315.9000 712018.6875 70
  316.0000 810477.3125 80
  316.1000 663241.0000 65
  316.2000 768474.3125 76
  316.3000 635464.7500 63
  316.4000 545135.7500 53
  316.5000 314345.0313 30
  354.8000 295150.1250 28
  354.9000 322248.8438 31
  626.9000 251792.2031 24
  627.0000 258566.8281 25
  627.1000 300795.6563 29
  627.2000 370574.8125 36
  627.3000 294021.0000 28
  627.4000 280020.0313 27