ACCESSION: MSBNK-RIKEN_NPDepo-CB000072
RECORD_TITLE: Quebrachidine; LC-ESI-QQQ; MS; [M+H]+
DATE: 2018.04.04
AUTHORS: Nogawa T, Okano A, CSRS, RIKEN
LICENSE: CC BY
COMMENT: Origin: Plant
COMMENT: SubCategory_DNP: Alkaloids derived from tryptophan, Secologanin typtamine alkaloids, Indole alkaloids

CH$NAME: Quebrachidine
CH$COMPOUND_CLASS: Alkaloids
CH$FORMULA: C21H24N2O3
CH$EXACT_MASS: 352.437
CH$SMILES: C/C=C1/CN2[C@H]3C[C@@H]1C1(C(=O)OC)[C@@H]2C[C@]2(c4ccccc4NC32)[C@H]1O
CH$IUPAC: InChI=1S/C21H24N2O3/c1-3-11-10-23-15-8-13(11)21(19(25)26-2)16(23)9-20(18(21)24)12-6-4-5-7-14(12)22-17(15)20/h3-7,13,15-18,22,24H,8-10H2,1-2H3/b11-3-/t13-,15-,16-,17?,18+,20+,21?/m0/s1
CH$LINK: CAS 4835-69-2
CH$LINK: CHEMSPIDER 4530444
CH$LINK: INCHIKEY RLUORQGMBKDXPO-GHBMVFGLSA-N

AC$INSTRUMENT: ABSciex API3200 LC/MS system
AC$INSTRUMENT_TYPE: LC-ESI-QQQ
AC$MASS_SPECTROMETRY: MS_TYPE MS
AC$MASS_SPECTROMETRY: ION_MODE POSITIVE

MS$FOCUSED_ION: PRECURSOR_TYPE [M+H]+

PK$SPLASH: splash10-0udi-0009000000-2cb972fdc6b210824dd5
PK$NUM_PEAK: 58
PK$PEAK: m/z int. rel.int.
  350.6000 308234.1563 26
  350.7000 294180.0625 25
  350.8000 324197.4375 27
  350.9000 399824.0313 34
  351.0000 372405.4375 32
  351.1000 397490.5313 34
  351.2000 330137.2813 28
  351.3000 779495.0625 68
  351.4000 376542.0625 32
  352.0000 263685.5000 22
  352.2000 313484.5313 26
  352.3000 1279606.5000 112
  352.4000 5911551.5000 524
  352.5000 9121440.0000 810
  352.6000 10808772.0000 960
  352.7000 10642510.0000 945
  352.8000 11149357.0000 990
  352.9000 10935206.0000 971
  353.0000 11245455.0000 999
  353.1000 11127455.0000 988
  353.2000 10732562.0000 953
  353.3000 10398872.0000 923
  353.4000 10220624.0000 907
  353.5000 6978279.5000 619
  353.6000 6183776.0000 548
  353.7000 6288677.0000 558
  353.8000 5788777.5000 513
  353.9000 5690770.5000 505
  354.0000 5884398.0000 522
  354.1000 5692096.0000 505
  354.2000 5720575.0000 507
  354.3000 5200894.5000 461
  354.4000 5094402.0000 452
  354.5000 2850741.7500 252
  354.6000 1854071.7500 163
  354.7000 1538147.8750 135
  354.8000 1304797.6250 115
  354.9000 1368279.5000 120
  355.0000 1449528.0000 127
  355.1000 1484848.5000 131
  355.2000 1518313.0000 134
  355.3000 1171682.3750 103
  355.4000 1154127.6250 101
  355.5000 582791.6875 50
  355.6000 304999.0625 26
  366.6000 354585.9688 30
  366.7000 429894.3438 37
  366.8000 430795.9688 37
  366.9000 388899.0000 33
  367.0000 488656.1875 42
  367.1000 895904.9375 78
  367.2000 432227.9063 37
  367.3000 291581.4688 24
  393.8000 297892.5000 25
  393.9000 297574.2813 25
  394.0000 333054.1250 28
  394.1000 342388.1250 29
  394.2000 255889.5000 21