ACCESSION: MSBNK-RIKEN_NPDepo-CB000183
RECORD_TITLE: Lycoctonine; LC-ESI-QQQ; MS; [M+H]+
DATE: 2018.04.04
AUTHORS: Nogawa T, Okano A, CSRS, RIKEN
LICENSE: CC BY
COMMENT: Origin: Plant
COMMENT: Formula(Parent): C25H41NO7
COMMENT: Bottle Name:Lycoctonine
COMMENT: PRIME Parent Name:Lycoctonine
COMMENT: PRIME in-house No.:V0307
COMMENT: SubCategory_DNP: Terpenoid alkaloids, Diterpene alkaloid, Aconitum alkaloid

CH$NAME: (1S,4S,9S,13S,16S,18S,5R,8R)-11-ethyl-13-(hydroxymethyl)-4,6,16,18-tetramethoxy-11-azahexacyclo(7.7.2.1(2,5).0(1,10).0(3,8).0(13,17))nonadecane-8,9-diol
CH$NAME: Lycoctonine
CH$COMPOUND_CLASS: Alkaloids
CH$FORMULA: C25H41NO7
CH$EXACT_MASS: 467.608
CH$SMILES: CCN1C[C@]2(CO)CC[C@H](OC)C34C5C[C@@H]6[C@@H](OC)C[C@@](O)(C5[C@H]6OC)C(O)([C@@H](OC)C32)[C@@H]14
CH$IUPAC: InChI=1S/C25H41NO7/c1-6-26-11-22(12-27)8-7-16(31-3)24-14-9-13-15(30-2)10-23(28,17(14)18(13)32-4)25(29,21(24)26)20(33-5)19(22)24/h13-21,27-29H,6-12H2,1-5H3/t13-,14?,15+,16+,17?,18+,19?,20+,21+,22+,23-,24?,25?/m1/s1
CH$LINK: CAS 26000-17-9
CH$LINK: CHEMSPIDER 90281 390348 10145862
CH$LINK: INCHIKEY YOTUXHIWBVZAJQ-AKOUUINKSA-N

AC$INSTRUMENT: ABSciex API3200 LC/MS system
AC$INSTRUMENT_TYPE: LC-ESI-QQQ
AC$MASS_SPECTROMETRY: MS_TYPE MS
AC$MASS_SPECTROMETRY: ION_MODE POSITIVE

MS$FOCUSED_ION: PRECURSOR_TYPE [M+H]+

PK$SPLASH: splash10-014i-0000900000-4e522ad23b92465f8833
PK$NUM_PEAK: 62
PK$PEAK: m/z int. rel.int.
  403.6000 227605.1719 24
  403.7000 344491.3125 37
  403.8000 376126.9063 40
  403.9000 353925.3438 38
  404.0000 347680.3438 37
  404.1000 320533.9688 34
  404.2000 361170.2813 38
  404.3000 331868.1563 35
  404.4000 329734.7188 35
  435.5000 211070.6250 22
  435.6000 376849.1250 40
  435.7000 468611.2813 50
  435.8000 494868.7188 53
  435.9000 490912.8438 53
  436.0000 509036.3438 55
  436.1000 491357.3438 53
  436.2000 524904.1250 57
  436.3000 427763.8750 46
  436.4000 430397.4688 46
  436.5000 318856.1563 34
  467.3000 205936.9688 21
  467.4000 1478583.5000 162
  467.5000 4877226.5000 538
  467.6000 7032679.5000 777
  467.7000 7778590.5000 859
  467.8000 8555978.0000 946
  467.9000 8755502.0000 968
  468.0000 9034512.0000 999
  468.1000 8913792.0000 985
  468.2000 8802729.0000 973
  468.3000 8640696.0000 955
  468.4000 8263834.5000 913
  468.5000 6376000.5000 704
  468.6000 4253092.5000 469
  468.7000 5049238.5000 557
  468.8000 5148234.0000 568
  468.9000 5070861.5000 560
  469.0000 5004524.0000 552
  469.1000 5119543.5000 565
  469.2000 5017480.5000 554
  469.3000 4762851.0000 526
  469.4000 4444674.5000 490
  469.5000 3383542.0000 373
  469.6000 1937349.8750 213
  469.7000 1829819.5000 201
  469.8000 1821730.3750 200
  469.9000 1877845.3750 206
  470.0000 1699310.5000 187
  470.1000 1845420.8750 203
  470.2000 1904202.6250 209
  470.3000 1834375.6250 202
  470.4000 1490473.2500 163
  470.5000 1056375.6250 115
  470.6000 503191.5313 54
  470.7000 380082.7500 41
  470.8000 379227.0938 40
  470.9000 334012.7813 35
  471.0000 321734.0625 34
  471.1000 308255.3438 33
  471.2000 326123.3125 35
  471.3000 342580.0313 36
  471.4000 252651.3594 26