ACCESSION: MSBNK-RIKEN_NPDepo-CB000252
RECORD_TITLE: Kokanidin; LC-ESI-QQQ; MS; [M+H]+
DATE: 2018.04.04
AUTHORS: Nogawa T, Okano A, CSRS, RIKEN
LICENSE: CC BY
COMMENT: Origin: Plant, Coumarins, Coumarin terpenoids

CH$NAME: Kokanidin
CH$COMPOUND_CLASS: Benzopyranoids
CH$FORMULA: C26H34O6
CH$EXACT_MASS: 442.5573
CH$SMILES: CC(=O)OC1CC[C@]2(C)C(CC[C@@](C)(O)[C@H]2COc2ccc3ccc(=O)oc3c2)C1(C)C
CH$IUPAC: InChI=1S/C26H34O6/c1-16(27)31-22-11-12-25(4)20(24(22,2)3)10-13-26(5,29)21(25)15-30-18-8-6-17-7-9-23(28)32-19(17)14-18/h6-9,14,20-22,29H,10-13,15H2,1-5H3/t20?,21-,22?,25+,26+/m0/s1
CH$LINK: INCHIKEY RIPKCRCUFJSKKD-FBQVDBQASA-N
CH$LINK: PUBCHEM CID:126961508

AC$INSTRUMENT: ABSciex API3200 LC/MS system
AC$INSTRUMENT_TYPE: LC-ESI-QQQ
AC$MASS_SPECTROMETRY: MS_TYPE MS
AC$MASS_SPECTROMETRY: ION_MODE POSITIVE

MS$FOCUSED_ION: PRECURSOR_TYPE [M+H]+

PK$SPLASH: splash10-001i-0007900030-edbfbf25970b0e0b6a78
PK$NUM_PEAK: 229
PK$PEAK: m/z int. rel.int.
  117.1000 79031.9531 22
  162.4000 134483.2969 39
  162.5000 263808.3125 78
  162.6000 343577.2188 102
  162.7000 331602.6250 99
  162.8000 353340.9688 105
  162.9000 340076.9063 101
  163.0000 390738.4375 116
  163.1000 327733.9063 97
  163.2000 290889.1563 86
  163.3000 277256.6563 82
  163.4000 208356.9844 61
  164.0000 88058.9219 25
  202.5000 114587.1250 33
  202.6000 219226.1719 65
  202.7000 195461.3281 58
  202.8000 293284.0938 87
  202.9000 308206.2188 92
  203.0000 301021.4688 89
  203.1000 347445.9063 103
  203.2000 222542.1875 66
  203.3000 309127.3750 92
  203.4000 245017.5000 72
  203.5000 246122.8438 73
  203.6000 87874.6875 25
  203.7000 79031.9531 22
  204.1000 88980.0313 25
  213.3000 96717.4297 28
  223.0000 75347.4922 21
  364.5000 208725.4531 62
  364.6000 263439.8438 78
  364.7000 465717.4375 139
  364.8000 468480.8125 140
  364.9000 496298.5313 148
  365.0000 541986.0000 162
  365.1000 749237.8125 225
  365.2000 330313.0313 98
  365.3000 443426.3750 132
  365.4000 381343.0313 114
  365.5000 187171.2656 55
  365.6000 125087.8672 36
  365.7000 153089.8594 45
  365.8000 166169.7500 49
  365.9000 117534.7031 34
  366.0000 164695.9531 48
  366.1000 95796.3047 27
  366.2000 152537.2031 45
  366.3000 117350.4766 34
  366.4000 124719.4297 36
  382.4000 185513.2656 55
  382.5000 888142.3750 267
  382.6000 1969535.6250 593
  382.7000 2582079.0000 778
  382.8000 3042085.5000 917
  382.9000 2957895.0000 891
  383.0000 3004320.0000 905
  383.1000 3312710.0000 999
  383.2000 3268128.2500 985
  383.3000 2438937.2500 735
  383.4000 2314033.7500 697
  383.5000 1652117.8750 497
  383.6000 954094.2500 287
  383.7000 908222.6875 273
  383.8000 976938.1250 293
  383.9000 913565.1875 274
  384.0000 843560.0625 253
  384.1000 843928.5625 253
  384.2000 830848.8125 249
  384.3000 866956.6250 260
  384.4000 825322.0625 248
  384.5000 490956.1563 147
  384.6000 192329.5313 57
  384.7000 137615.0938 40
  384.8000 124166.7578 36
  384.9000 571646.0000 171
  385.0000 173538.7188 51
  385.1000 151616.0781 44
  385.2000 131351.4844 38
  385.3000 185513.2656 55
  385.4000 130983.0234 38
  424.4000 83453.3203 24
  424.5000 194908.6406 57
  424.6000 586752.3750 176
  424.7000 1020967.5625 307
  424.8000 859403.4375 258
  424.9000 1160425.2500 349
  425.0000 1104973.5000 332
  425.1000 1027599.6250 309
  425.2000 978780.4375 294
  425.3000 811136.8750 243
  425.4000 733947.1875 220
  425.5000 412476.8438 123
  425.6000 335471.3125 100
  425.7000 496667.0938 148
  425.8000 328286.5625 98
  425.9000 257913.1563 76
  426.0000 342471.8438 102
  426.1000 244464.8281 72
  426.2000 244833.2813 72
  426.3000 244649.0625 72
  426.4000 272835.2500 81
  426.5000 146089.3750 43
  426.6000 104086.3828 30
  427.1000 83637.5469 24
  442.4000 277072.4063 82
  442.5000 1004755.9375 302
  442.6000 1648433.5000 496
  442.7000 2095360.0000 631
  442.8000 2193551.2500 661
  442.9000 2243476.0000 676
  443.0000 2326192.5000 701
  443.1000 2116914.0000 638
  443.2000 2404487.2500 724
  443.3000 2090754.5000 630
  443.4000 1980404.7500 596
  443.5000 1084524.8750 326
  443.6000 1039021.6250 312
  443.7000 795846.2500 239
  443.8000 662836.7500 199
  443.9000 838586.1875 252
  444.0000 823111.4375 247
  444.1000 801741.5000 241
  444.2000 647914.6250 194
  444.3000 701155.3125 210
  444.4000 693786.3750 208
  444.5000 199330.0313 59
  444.6000 240964.5781 71
  444.7000 173722.9531 51
  444.8000 179618.0781 53
  444.9000 257176.2656 76
  445.0000 116613.5938 34
  445.1000 194724.4219 57
  445.2000 139088.8594 40
  445.3000 123982.5313 36
  445.4000 131719.9219 38
  459.5000 173170.2813 51
  459.6000 423345.9688 126
  459.7000 488745.4688 146
  459.8000 739105.3750 222
  459.9000 563171.7500 169
  460.0000 528722.0000 158
  460.1000 745369.0000 224
  460.2000 746290.1875 224
  460.3000 523379.4688 156
  460.4000 541433.4375 162
  460.5000 260123.8281 77
  460.6000 189013.4844 56
  460.7000 206330.5469 61
  460.8000 220884.1875 65
  460.9000 218489.2813 64
  461.0000 227516.2344 67
  461.1000 227147.7813 67
  461.2000 142404.9063 41
  461.3000 193066.4219 57
  461.4000 116982.0313 34
  461.5000 102244.1563 29
  461.7000 89901.1484 26
  461.9000 83637.5469 24
  866.5000 91006.4922 26
  866.6000 105007.5000 30
  866.7000 203014.4844 60
  866.8000 175012.5156 51
  866.9000 223831.7813 66
  867.0000 196014.0000 58
  867.1000 139825.7656 41
  867.2000 259018.5000 77
  867.3000 210015.0000 62
  867.4000 118824.2656 34
  867.5000 76637.0469 22
  867.7000 84006.0000 24
  867.9000 97822.7656 28
  868.0000 76821.2734 22
  868.1000 125640.5469 36
  868.2000 98007.0000 28
  868.3000 91006.4922 26
  884.5000 175012.5156 51
  884.6000 455032.4375 136
  884.7000 846876.2500 254
  884.8000 1091893.7500 328
  884.9000 1147713.5000 345
  885.0000 1309093.5000 394
  885.1000 1232088.0000 370
  885.2000 1280907.1250 385
  885.3000 966068.8750 290
  885.4000 811873.7500 244
  885.5000 720867.3125 216
  885.6000 357025.5000 106
  885.7000 630045.0000 189
  885.8000 539038.5625 161
  885.9000 616044.0000 184
  886.0000 623044.4375 187
  886.1000 679048.3750 203
  886.2000 763054.4375 229
  886.3000 587673.5000 176
  886.4000 496851.3125 148
  886.5000 433846.7813 129
  886.6000 174828.2969 51
  886.7000 217015.5156 64
  886.8000 133009.4844 39
  886.9000 174644.0625 51
  887.0000 224016.0000 66
  887.1000 237832.7656 70
  887.2000 210015.0000 62
  887.3000 147010.5000 43
  887.4000 769870.6875 231
  887.5000 854060.9375 256
  887.6000 118640.0469 34
  901.6000 119008.4922 34
  901.7000 182012.9844 53
  901.8000 181644.5469 53
  901.9000 230648.0313 68
  902.0000 161011.5000 47
  902.1000 209830.7813 62
  902.2000 230832.2656 68
  902.3000 147010.5000 43
  902.4000 146642.0469 43
  902.5000 111823.7734 32
  902.6000 98007.0000 28
  902.8000 84006.0000 24
  902.9000 111639.5469 32
  903.0000 90085.3750 26
  903.1000 104823.2734 30
  903.2000 119008.4922 34
  903.3000 98007.0000 28
  903.4000 76821.2734 22
  1327.3000 139825.7656 41
  1327.4000 112008.0000 32
  1327.5000 91006.4922 26
  1328.3000 91006.4922 26