ACCESSION: MSBNK-RIKEN_NPDepo-CB000268
RECORD_TITLE: Diffractic acid; LC-ESI-QQQ; MS; [M+H]+
DATE: 2018.04.04
AUTHORS: Nogawa T, Okano A, CSRS, RIKEN
LICENSE: CC BY
COMMENT: Origin: Microbe, Carboxylic acids

CH$NAME: Diffractic acid
CH$COMPOUND_CLASS: Carbohydrates
CH$FORMULA: C20H22O7
CH$EXACT_MASS: 374.3941
CH$SMILES: COc1cc(C)c(C(=O)Oc2cc(C)c(C(=O)O)c(O)c2C)c(OC)c1C
CH$IUPAC: InChI=1S/C20H22O7/c1-9-8-14(11(3)17(21)15(9)19(22)23)27-20(24)16-10(2)7-13(25-5)12(4)18(16)26-6/h7-8,21H,1-6H3,(H,22,23)
CH$LINK: CAS 436-32-8
CH$LINK: CHEMSPIDER 85597
CH$LINK: INCHIKEY MIJKZXWOOXIEEU-UHFFFAOYSA-N
CH$LINK: COMPTOX DTXSID40195883
CH$LINK: PUBCHEM CID:94870

AC$INSTRUMENT: ABSciex API3200 LC/MS system
AC$INSTRUMENT_TYPE: LC-ESI-QQQ
AC$MASS_SPECTROMETRY: MS_TYPE MS
AC$MASS_SPECTROMETRY: ION_MODE POSITIVE

MS$FOCUSED_ION: PRECURSOR_TYPE [M+H]+

PK$SPLASH: splash10-004i-0319000000-fc1794ff2d28831910ae
PK$NUM_PEAK: 72
PK$PEAK: m/z int. rel.int.
  107.3000 78684.5859 31
  109.5000 69531.9766 28
  114.2000 90651.7891 36
  114.3000 118984.8359 48
  114.4000 94601.4141 38
  114.5000 93560.6484 38
  127.2000 63264.6602 25
  193.2000 102429.6172 41
  193.3000 652678.3750 272
  193.4000 901456.3125 376
  193.5000 1112677.3750 464
  193.6000 1088365.1250 454
  193.7000 938397.9375 391
  193.8000 270867.3438 112
  194.3000 75349.9844 30
  194.4000 123691.2656 50
  194.5000 133719.0313 54
  194.6000 123738.5469 50
  194.7000 109524.7188 44
  211.2000 109477.4141 44
  211.3000 281888.3750 117
  211.4000 384507.1875 160
  211.5000 396001.2188 164
  211.6000 381361.6563 158
  211.7000 362701.6250 150
  211.8000 118228.0391 48
  212.4000 56713.5078 22
  212.5000 63430.1992 25
  212.6000 58274.4258 23
  212.7000 53189.6016 21
  229.5000 64730.9688 26
  229.6000 56453.3398 22
  375.2000 196747.1563 81
  375.3000 1188784.0000 496
  375.4000 1897419.2500 793
  375.5000 2312672.0000 967
  375.6000 2388045.5000 999
  375.7000 2217999.5000 927
  375.8000 1377040.8750 575
  375.9000 284489.9063 118
  376.0000 114136.5234 46
  376.3000 264599.9375 109
  376.4000 501931.0625 209
  376.5000 580473.8750 242
  376.6000 642508.7500 268
  376.7000 570966.5000 238
  376.8000 320651.2813 133
  376.9000 81002.4063 32
  377.4000 64447.1680 25
  377.5000 115082.5391 47
  377.6000 97746.8438 39
  377.7000 95263.5547 38
  377.8000 61656.4219 24
  393.4000 80292.8984 32
  393.5000 66741.2500 26
  393.6000 95476.4219 38
  393.7000 86229.1328 35
  393.8000 54064.6680 21
  429.3000 54632.2773 21
  429.4000 126198.2031 51
  429.5000 148476.8125 61
  429.6000 166072.6719 68
  429.7000 168390.3906 69
  429.8000 92449.1563 37
  447.4000 54372.1289 21
  447.5000 53615.3164 21
  447.7000 74876.9688 30
  766.6000 87979.2734 35
  766.7000 117021.8828 48
  766.8000 135492.7813 55
  766.9000 121586.3750 49
  767.8000 59125.8438 23