ACCESSION: MSBNK-RIKEN_NPDepo-CB000340
RECORD_TITLE: Lasalocid A Na salt; LC-ESI-QQQ; MS; [M+H]+
DATE: 2018.04.04
AUTHORS: Nogawa T, Okano A, CSRS, RIKEN
LICENSE: CC BY

CH$NAME: Lasalocid A Na salt
CH$COMPOUND_CLASS: Polyketide
CH$FORMULA: C34H53NaO8
CH$EXACT_MASS: 612.7865
CH$SMILES: CC[C@@H](C(=O)[C@@H](C)[C@@H](O)[C@H](C)CCc1ccc(C)c([O-])c1C(=O)O)[C@H]1O[C@](CC)([C@H]2CC[C@](O)(CC)[C@H](C)O2)C[C@@H]1C.[Na+]
CH$IUPAC: InChI=1S/C34H54O8.Na/c1-9-25(31-21(6)18-34(11-3,42-31)26-16-17-33(40,10-2)23(8)41-26)30(37)22(7)28(35)19(4)12-14-24-15-13-20(5)29(36)27(24)32(38)39;/h13,15,19,21-23,25-26,28,31,35-36,40H,9-12,14,16-18H2,1-8H3,(H,38,39);/q;+1/p-1/t19-,21+,22+,23+,25+,26-,28+,31+,33-,34+;/m1./s1
CH$LINK: INCHIKEY RDHDUYAKDYQPEW-HWLWSTNVSA-M
CH$LINK: COMPTOX DTXSID9045895
CH$LINK: PUBCHEM CID:6426773

AC$INSTRUMENT: ABSciex API3200 LC/MS system
AC$INSTRUMENT_TYPE: LC-ESI-QQQ
AC$MASS_SPECTROMETRY: MS_TYPE MS
AC$MASS_SPECTROMETRY: ION_MODE POSITIVE

MS$FOCUSED_ION: PRECURSOR_TYPE [M+H]+

PK$SPLASH: splash10-0a4i-0234097000-66b1194d29c1635be50c
PK$NUM_PEAK: 321
PK$PEAK: m/z int. rel.int.
  136.7000 17937.6230 22
  136.8000 22941.9590 28
  137.0000 17798.3535 22
  137.1000 17677.6582 21
  200.7000 21001.5078 26
  200.9000 21298.6113 26
  201.0000 18847.5020 23
  201.2000 19033.1934 23
  201.3000 17668.3750 21
  218.5000 27157.1113 34
  218.6000 42290.8086 53
  218.7000 63645.1289 81
  218.8000 71406.9766 91
  218.9000 55363.3594 70
  219.0000 69039.3984 88
  219.1000 66941.1094 85
  219.2000 65167.7656 83
  219.3000 53543.6133 68
  219.4000 78565.2969 100
  219.5000 49913.3672 63
  219.6000 18661.8125 23
  219.8000 17751.9336 22
  236.5000 61964.6445 79
  236.6000 169237.5625 218
  236.7000 211249.8906 272
  236.8000 227989.7813 294
  236.9000 211816.1875 273
  237.0000 228816.0938 295
  237.1000 209244.4063 270
  237.2000 198808.6563 256
  237.3000 176423.7344 227
  237.4000 170890.2031 220
  237.5000 152497.6406 196
  237.6000 63088.0547 80
  237.7000 41566.6406 52
  237.8000 27751.3203 34
  237.9000 39459.0508 50
  238.0000 42281.5352 53
  238.1000 45781.7695 58
  238.2000 41808.0195 53
  238.3000 38864.8516 49
  238.4000 51566.0039 65
  238.5000 26089.3926 32
  254.5000 29951.7324 37
  254.6000 35782.3750 45
  254.7000 57443.0977 73
  254.8000 56068.9727 71
  254.9000 91182.8984 117
  255.0000 68881.5781 88
  255.1000 52327.3594 66
  255.2000 79976.5156 102
  255.3000 54202.8086 69
  255.4000 70320.6719 90
  255.5000 64564.2891 82
  255.6000 29376.1016 37
  255.7000 18188.3066 22
  255.9000 18921.7793 23
  262.8000 18801.0840 23
  263.3000 20657.9785 25
  280.7000 21818.5254 27
  280.8000 21066.4824 26
  280.9000 33665.5195 42
  281.0000 33127.0313 41
  281.1000 34204.0313 43
  281.2000 39839.7109 50
  281.3000 34194.7461 43
  281.4000 19246.7344 23
  281.5000 29506.0781 37
  281.6000 17612.6680 21
  301.0000 19692.3945 24
  318.6000 55688.3164 71
  318.7000 74396.5547 95
  318.8000 89808.8203 115
  318.9000 94748.1641 121
  319.0000 80440.7578 103
  319.1000 84535.2188 108
  319.2000 79595.8594 102
  319.3000 67461.0781 86
  319.4000 64127.9258 82
  319.5000 51138.9297 65
  319.6000 35921.6523 45
  319.9000 19683.0996 24
  320.0000 21902.0918 27
  320.2000 19803.8008 24
  336.5000 64564.2969 82
  336.6000 179719.7656 231
  336.7000 308597.5938 398
  336.8000 385900.2500 499
  336.9000 379271.2188 490
  337.0000 425944.1875 551
  337.1000 402510.1875 520
  337.2000 370664.4375 479
  337.3000 280094.2500 361
  337.4000 318661.9688 411
  337.5000 299860.9375 387
  337.6000 147474.7344 190
  337.7000 94144.6406 121
  337.8000 116455.2891 149
  337.9000 124337.7891 160
  338.0000 98963.2969 127
  338.1000 99761.7656 128
  338.2000 89251.7344 114
  338.3000 108192.0938 139
  338.4000 79698.0156 102
  338.5000 64174.3359 82
  338.6000 42132.9766 53
  338.7000 23192.6406 29
  338.8000 21530.7188 26
  338.9000 20481.5703 25
  354.6000 17529.1074 21
  354.7000 28531.2148 35
  354.8000 29710.3418 37
  354.9000 28159.8398 35
  355.0000 29701.0527 37
  355.1000 36757.2656 46
  355.2000 39208.3594 49
  355.3000 19525.2617 24
  355.4000 23953.9648 30
  355.5000 19822.3730 24
  536.7000 24733.8633 31
  536.8000 32857.7813 41
  536.9000 36822.2578 46
  537.0000 36283.7539 46
  537.1000 25708.7324 32
  537.2000 39096.9570 49
  537.3000 40303.9375 51
  537.4000 33257.0156 42
  537.5000 22654.1367 28
  537.9000 21382.1660 26
  554.6000 54434.9219 69
  554.7000 105555.3047 135
  554.8000 147075.5000 189
  554.9000 172700.6875 222
  555.0000 203348.7656 262
  555.1000 170490.9531 219
  555.2000 191882.4219 247
  555.3000 164521.0625 212
  555.4000 139257.9375 179
  555.5000 100560.2422 129
  555.6000 45419.6836 57
  555.7000 70887.0313 90
  555.8000 60581.2539 77
  555.9000 90486.5625 116
  556.0000 72743.9219 93
  556.1000 72316.8359 92
  556.2000 76364.8516 97
  556.3000 76736.2578 98
  556.4000 62976.6445 80
  556.5000 29023.2891 36
  557.0000 18903.2090 23
  557.1000 18373.9961 22
  557.2000 19274.5898 23
  557.3000 36636.5703 46
  557.4000 31502.2520 39
  572.5000 34278.3086 43
  572.6000 115898.2188 149
  572.7000 255945.3438 330
  572.8000 220228.0000 284
  572.9000 284420.8750 367
  573.0000 300380.8750 388
  573.1000 295311.5313 381
  573.2000 316443.0625 409
  573.3000 300631.5313 388
  573.4000 242529.2656 313
  573.5000 189422.0000 244
  573.6000 91015.7891 116
  573.7000 109918.9922 141
  573.8000 125888.3203 162
  573.9000 134392.8906 173
  574.0000 139387.9219 179
  574.1000 107959.9766 138
  574.2000 124514.2031 160
  574.3000 120661.1406 155
  574.4000 84200.9844 108
  574.5000 69438.6406 88
  574.6000 23610.4375 29
  574.7000 28373.3750 35
  574.8000 27407.7891 34
  574.9000 32217.1563 40
  575.0000 29496.7949 37
  575.1000 32402.8418 40
  575.2000 21363.5977 26
  575.3000 32245.0078 40
  575.4000 25504.4727 32
  590.5000 41093.1211 52
  590.6000 150585.0156 194
  590.7000 300102.3438 387
  590.8000 399047.0625 516
  590.9000 443556.9063 573
  591.0000 478596.5000 619
  591.1000 446202.9688 577
  591.2000 453212.6250 586
  591.3000 436751.4375 565
  591.4000 351315.5000 454
  591.5000 243392.7656 314
  591.6000 108387.0234 139
  591.7000 129407.0859 166
  591.8000 178169.2500 229
  591.9000 159442.4688 205
  592.0000 197898.7188 255
  592.1000 188929.9375 243
  592.2000 194909.1719 251
  592.3000 176785.8438 228
  592.4000 157028.4375 202
  592.5000 105443.8672 135
  592.6000 55019.8281 70
  592.7000 41845.1563 53
  592.8000 52513.0273 67
  592.9000 50303.3164 64
  593.0000 60117.0195 76
  593.1000 45271.1328 57
  593.2000 46478.1094 59
  593.3000 49504.8477 63
  593.4000 47759.3789 60
  593.5000 26163.6680 32
  607.4000 24371.7617 30
  607.5000 76383.4375 97
  607.6000 250569.6719 323
  607.7000 486692.5938 629
  607.8000 636107.7500 823
  607.9000 688073.1250 890
  608.0000 731868.0000 947
  608.1000 771614.8750 999
  608.2000 676532.3750 875
  608.3000 688797.4375 891
  608.4000 626099.2500 810
  608.5000 417151.8438 539
  608.6000 213255.2969 275
  608.7000 262073.0156 338
  608.8000 242659.2031 313
  608.9000 288933.0313 373
  609.0000 325374.8125 420
  609.1000 272703.7813 352
  609.2000 269955.6250 348
  609.3000 285516.4688 369
  609.4000 223022.5938 288
  609.5000 198892.2188 256
  609.6000 74155.1641 95
  609.7000 62261.7461 79
  609.8000 57396.6719 73
  609.9000 65084.2227 83
  610.0000 76596.9844 98
  610.1000 70441.3672 90
  610.2000 81220.6563 104
  610.3000 76151.3047 97
  610.4000 46886.6445 59
  610.5000 39876.8516 50
  611.0000 20240.1777 25
  611.1000 22338.4648 27
  612.6000 35113.9141 44
  612.7000 76894.0781 98
  612.8000 67303.2188 86
  612.9000 83318.9375 106
  613.0000 85277.9688 109
  613.1000 83226.0859 106
  613.2000 89725.2109 115
  613.3000 87989.0156 113
  613.4000 60664.8008 77
  613.5000 30935.8965 39
  613.6000 17037.0273 21
  613.7000 30657.3633 38
  613.8000 36088.7813 45
  613.9000 34658.9727 43
  614.0000 30926.6133 39
  614.1000 29728.9160 37
  614.2000 36562.2969 46
  614.3000 35587.4180 45
  614.4000 30425.2500 38
  621.9000 21994.9316 27
  622.3000 17464.1172 21
  1180.9000 18680.3789 23
  1181.2000 21484.2949 26
  1181.3000 17575.5254 21
  1181.4000 21772.1094 27
  1181.6000 17046.3105 21
  1181.7000 19200.3125 23
  1182.0000 18262.5781 22
  1182.3000 17482.6816 21
  1197.4000 29106.8496 36
  1197.5000 67758.1641 86
  1197.6000 71620.4922 91
  1197.7000 101507.2734 130
  1197.8000 131319.7656 169
  1197.9000 144280.8438 185
  1198.0000 133835.8281 172
  1198.1000 157687.6719 203
  1198.2000 154930.1719 199
  1198.3000 160491.6250 206
  1198.4000 181177.3906 233
  1198.5000 180295.4063 232
  1198.6000 182700.0313 235
  1198.7000 124894.8828 160
  1198.8000 131607.5938 169
  1198.9000 133278.7500 171
  1199.0000 117030.9063 150
  1199.1000 123817.9141 159
  1199.2000 114997.6094 148
  1199.3000 126371.0859 162
  1199.4000 141059.2031 181
  1199.5000 115870.3672 149
  1199.6000 107560.7344 138
  1199.7000 106205.2188 136
  1199.8000 60302.7109 77
  1199.9000 69020.8438 88
  1200.0000 51083.2266 65
  1200.1000 63143.7656 80
  1200.2000 53738.5898 68
  1200.3000 57368.8242 73
  1200.4000 62995.2148 80
  1200.5000 44407.6680 56
  1200.6000 42597.1914 54
  1200.7000 49170.6133 62
  1200.8000 22180.6250 27
  1200.9000 17612.6621 21
  1201.0000 30963.7539 39
  1201.1000 20073.0508 25
  1201.2000 19302.4414 24
  1201.3000 17547.6699 21
  1201.4000 21679.2637 27
  1201.5000 23981.8281 30
  1201.7000 17018.4609 21