ACCESSION: MSBNK-RIKEN_NPDepo-CB000432
RECORD_TITLE: Oleuropein; LC-ESI-QQQ; MS; [M+H]+
DATE: 2018.04.04
AUTHORS: Nogawa T, Okano A, CSRS, RIKEN
LICENSE: CC BY
COMMENT: Origin: Plant
COMMENT: SubCategory_DNP: Monoterpenoids, Secoiridoid monoterpenoids

CH$NAME: Oleuropein
CH$COMPOUND_CLASS: Terpenoids
CH$FORMULA: C25H32O13
CH$EXACT_MASS: 540.526
CH$SMILES: C/C=C1\C(O[C@@H]2O[C@H](CO)[C@@H](O)[C@H](O)[C@H]2O)OC=C(C(=O)OC)C1CC(=O)OCCc1ccc(O)c(O)c1
CH$IUPAC: InChI=1S/C25H32O13/c1-3-13-14(9-19(29)35-7-6-12-4-5-16(27)17(28)8-12)15(23(33)34-2)11-36-24(13)38-25-22(32)21(31)20(30)18(10-26)37-25/h3-5,8,11,14,18,20-22,24-28,30-32H,6-7,9-10H2,1-2H3/b13-3-/t14?,18-,20-,21+,22-,24?,25+/m1/s1
CH$LINK: CAS 2619-42-4
CH$LINK: CHEMSPIDER 4444876
CH$LINK: INCHIKEY RFWGABANNQMHMZ-JUVTZQQOSA-N
CH$LINK: PUBCHEM CID:24721401

AC$INSTRUMENT: ABSciex API3200 LC/MS system
AC$INSTRUMENT_TYPE: LC-ESI-QQQ
AC$MASS_SPECTROMETRY: MS_TYPE MS
AC$MASS_SPECTROMETRY: ION_MODE POSITIVE

MS$FOCUSED_ION: PRECURSOR_TYPE [M+H]+

PK$SPLASH: splash10-000i-0908020000-8f3a177b2870aa18162f
PK$NUM_PEAK: 178
PK$PEAK: m/z int. rel.int.
  100.6000 157991.0938 184
  100.7000 68142.0547 78
  100.8000 62891.5469 72
  100.9000 35651.6719 40
  101.0000 30457.7324 34
  101.1000 56342.7305 65
  101.2000 128831.7578 149
  101.3000 146784.7188 170
  101.4000 79404.8438 92
  101.5000 43386.1406 49
  113.7000 24360.6152 27
  113.8000 52023.8594 59
  113.9000 43132.1055 49
  114.0000 31417.5664 35
  114.1000 29187.5742 33
  114.2000 25517.9551 28
  134.8000 24812.2773 28
  136.4000 62552.8555 72
  136.5000 497487.1563 581
  136.6000 512165.6875 599
  136.7000 738016.3750 863
  136.8000 853552.8750 999
  136.9000 707671.5000 828
  137.0000 766752.3750 897
  137.1000 661039.1250 773
  137.2000 616213.4375 720
  137.3000 642549.9375 751
  137.4000 489583.3438 572
  137.5000 206204.2813 240
  137.6000 73420.5859 85
  137.7000 75876.3828 87
  137.8000 107209.2969 124
  137.9000 87647.3906 101
  138.0000 74916.6406 86
  138.1000 53548.1875 61
  138.2000 64444.1289 74
  138.3000 53971.5977 62
  138.4000 59984.1250 69
  138.5000 26957.5723 30
  150.7000 24925.1680 28
  150.8000 20916.8184 23
  150.9000 31982.1270 36
  151.0000 19364.2891 21
  151.2000 19448.9707 21
  164.4000 28284.2813 32
  164.5000 46999.3281 54
  164.6000 78360.4375 90
  164.7000 92954.2188 107
  164.8000 90893.5859 105
  164.9000 79461.3281 92
  165.0000 84260.0547 97
  165.1000 65629.6875 75
  165.2000 68113.7344 78
  165.3000 41692.5078 47
  165.4000 51798.0508 59
  206.8000 19392.5156 21
  224.6000 32857.1875 37
  224.9000 29328.7012 33
  225.0000 22017.6992 24
  225.1000 33647.5703 38
  225.2000 26393.0215 29
  225.3000 22017.7090 24
  225.4000 22384.6621 25
  286.7000 19561.8809 21
  286.8000 19533.6602 21
  287.1000 30232.0020 34
  328.6000 20069.9824 22
  328.8000 20154.6660 22
  328.9000 19082.0078 21
  346.6000 45757.3047 52
  346.7000 47648.5664 54
  346.8000 19307.8320 21
  346.9000 41099.7109 47
  347.0000 29808.5840 33
  347.1000 27296.3086 30
  347.2000 35143.6406 40
  347.3000 21001.5000 23
  347.4000 22836.3125 25
  360.4000 77005.5156 89
  360.5000 306046.0625 357
  360.6000 467622.1563 546
  360.7000 514254.5313 601
  360.8000 627617.4375 734
  360.9000 603059.1875 705
  361.0000 565290.3750 661
  361.1000 520464.6250 608
  361.2000 489639.9063 572
  361.3000 577484.9375 675
  361.4000 323857.8125 378
  361.5000 190396.6875 222
  361.6000 125698.5000 146
  361.7000 103454.9609 120
  361.8000 102212.9609 118
  361.9000 119177.8984 138
  362.0000 112318.5078 130
  362.1000 98119.9063 113
  362.2000 99474.8516 115
  362.3000 105289.7891 122
  362.4000 127759.1250 148
  362.5000 33929.8438 38
  362.7000 19138.4629 21
  363.1000 21735.4238 24
  378.4000 46067.8047 52
  378.5000 146954.0781 171
  378.6000 176141.6094 205
  378.7000 162479.3594 189
  378.8000 208801.2031 243
  378.9000 170496.0156 198
  379.0000 189013.5156 220
  379.1000 169141.0938 197
  379.2000 162055.9531 188
  379.3000 226895.2656 264
  379.4000 111584.5859 129
  379.5000 42369.9648 48
  379.6000 41015.0273 47
  379.7000 37627.6875 43
  379.8000 49935.0195 57
  379.9000 63625.5117 73
  380.0000 32462.0059 37
  380.1000 45277.4414 52
  380.2000 25376.8125 28
  380.3000 32857.1836 37
  380.4000 19392.5098 21
  540.5000 57754.1289 66
  540.6000 120928.0000 140
  540.7000 156495.0469 182
  540.8000 154095.7031 179
  540.9000 162959.2656 189
  541.0000 128408.3828 149
  541.1000 114830.7891 133
  541.2000 127984.9688 148
  541.3000 90526.6250 105
  541.4000 56004.0000 64
  541.5000 31135.2871 35
  541.6000 46096.0391 53
  541.7000 45079.8359 51
  541.8000 58826.7813 67
  541.9000 43866.0391 50
  542.0000 30062.6328 34
  542.1000 34466.1719 39
  542.2000 37966.4180 43
  542.3000 23259.7246 26
  557.5000 30119.0840 34
  557.6000 69158.1797 80
  557.7000 92107.3984 106
  557.8000 85276.2500 98
  557.9000 110907.1250 128
  558.0000 99503.0703 115
  558.1000 99898.2656 116
  558.2000 102382.3203 118
  558.3000 87167.5313 101
  558.4000 49850.3359 57
  558.5000 22074.1563 24
  558.6000 26590.6094 30
  558.7000 32574.9160 37
  558.8000 30062.6328 34
  558.9000 31699.8457 36
  559.0000 31135.2949 35
  559.1000 30486.0430 34
  559.2000 53011.8594 61
  559.3000 21509.5996 24
  720.6000 20098.2090 22
  720.8000 30598.9629 34
  720.9000 28397.1914 32
  721.0000 28623.0137 32
  721.1000 21848.3340 24
  721.2000 26872.8867 30
  900.6000 19223.1484 21
  900.7000 20747.4512 23
  900.8000 23344.4141 26
  900.9000 20521.6270 23
  901.0000 35623.5156 40
  901.3000 19420.7422 21
  1097.8000 19928.8438 22
  1097.9000 25150.9922 28
  1098.2000 19082.0078 21
  1098.3000 20803.9063 23
  1099.1000 18912.6465 21