ACCESSION: MSBNK-RIKEN_NPDepo-CB000446
RECORD_TITLE: Linichlorin A; LC-ESI-QQQ; MS; [M+H]+
DATE: 2018.04.04
AUTHORS: Nogawa T, Okano A, CSRS, RIKEN
LICENSE: CC BY
COMMENT: Origin: Plant
COMMENT: SubCategory_DNP: Sesquiterpenoids

CH$NAME: Linichlorin A
CH$COMPOUND_CLASS: Terpenoids
CH$FORMULA: C19H23ClO6
CH$EXACT_MASS: 382.8446
CH$SMILES: C=C(C)C(=O)O[C@H]1CC(=C)C2C[C@@H](O)[C@@](O)(CCl)C2[C@H]2OC(=O)C(=C)C12
CH$IUPAC: InChI=1S/C19H23ClO6/c1-8(2)17(22)25-12-5-9(3)11-6-13(21)19(24,7-20)15(11)16-14(12)10(4)18(23)26-16/h11-16,21,24H,1,3-7H2,2H3/t11?,12-,13+,14?,15?,16-,19-/m0/s1
CH$LINK: CAS 62462-98-0
CH$LINK: CHEMSPIDER 158587
CH$LINK: INCHIKEY ONMAQPPVCANFPB-WZKNLRRUSA-N

AC$INSTRUMENT: ABSciex API3200 LC/MS system
AC$INSTRUMENT_TYPE: LC-ESI-QQQ
AC$MASS_SPECTROMETRY: MS_TYPE MS
AC$MASS_SPECTROMETRY: ION_MODE POSITIVE

MS$FOCUSED_ION: PRECURSOR_TYPE [M+H]+

PK$SPLASH: splash10-03e9-0175200900-bf9314352e980ee34192
PK$NUM_PEAK: 421
PK$PEAK: m/z int. rel.int.
  100.9000 117835.9766 62
  101.0000 180478.3906 96
  101.1000 247052.0625 132
  101.2000 309332.4375 166
  101.3000 281692.5000 151
  101.4000 241482.7188 129
  101.5000 109042.2266 58
  118.7000 43916.9219 22
  118.8000 43985.8633 22
  118.9000 55538.4258 29
  119.0000 61211.2500 32
  119.1000 66470.2500 35
  119.2000 55262.5547 28
  146.7000 58538.6680 30
  149.1000 77677.9609 41
  168.9000 65487.4414 34
  169.1000 71022.3203 37
  169.2000 76574.4219 40
  169.3000 41502.9648 21
  182.4000 113404.6563 60
  182.5000 211325.4219 113
  182.6000 272760.8438 146
  182.7000 182547.5156 97
  182.8000 222533.1563 119
  182.9000 216412.0156 116
  183.0000 204928.3906 110
  183.1000 200203.9531 107
  183.2000 167374.0000 89
  183.3000 193720.7500 104
  183.4000 150872.8594 80
  184.5000 65073.6133 34
  184.6000 72987.9766 38
  184.7000 86075.1094 45
  184.8000 93385.9844 49
  184.9000 83937.0313 44
  185.0000 73263.8516 38
  185.1000 87402.7969 46
  185.2000 85713.0156 45
  185.3000 59607.7031 31
  185.4000 51848.5313 27
  186.9000 47468.9141 24
  196.5000 98300.1328 52
  196.6000 57814.4727 30
  196.8000 73056.9375 38
  196.9000 46330.8984 24
  197.0000 49020.7422 25
  197.1000 53779.7031 28
  201.1000 52658.9375 27
  214.5000 58452.4531 30
  214.6000 72729.3281 38
  214.7000 73401.8047 38
  214.8000 79885.0234 42
  214.9000 93765.3281 49
  215.0000 127560.8438 68
  215.1000 111249.3359 59
  215.2000 78609.0547 41
  215.3000 70574.0156 37
  215.4000 47037.8477 24
  223.1000 45917.0742 23
  223.2000 40606.3516 21
  224.5000 47520.6367 24
  224.6000 149458.9688 80
  224.7000 116318.6719 62
  224.8000 65746.0625 34
  224.9000 87126.9063 46
  225.0000 79298.7578 41
  225.1000 50072.5313 26
  225.2000 70194.6563 37
  225.3000 59607.7031 31
  225.4000 60538.8125 31
  232.4000 52452.0195 27
  232.5000 95248.2031 50
  232.6000 98989.8203 52
  232.7000 117198.0313 62
  232.8000 105748.9375 56
  232.9000 96541.3750 51
  233.0000 97903.5469 52
  233.1000 87264.8359 46
  233.2000 97024.1797 51
  233.3000 77350.3516 40
  233.4000 63590.7461 33
  234.8000 52917.5664 27
  234.9000 40916.7188 21
  235.0000 50003.5664 26
  235.1000 57004.0781 29
  235.2000 44123.8359 22
  242.4000 126509.0234 67
  242.5000 106352.4375 56
  242.6000 133630.2500 71
  242.7000 144993.1250 77
  242.8000 246741.7344 132
  242.9000 194496.6563 104
  243.0000 142320.5000 76
  243.1000 153821.3125 82
  243.2000 151717.7188 81
  243.3000 115835.8594 61
  243.4000 96041.3516 51
  243.6000 43382.4063 22
  250.4000 41865.0625 21
  250.5000 62418.2539 32
  250.6000 52934.8125 27
  250.7000 60297.4180 31
  250.8000 85040.5547 45
  250.9000 87816.6172 46
  251.0000 90092.6484 47
  251.1000 73936.3203 39
  251.2000 60573.2930 31
  251.3000 73850.1094 39
  251.4000 45382.5547 23
  252.7000 44744.5781 23
  260.4000 89006.3672 47
  260.5000 122939.7969 65
  260.6000 145165.5313 77
  260.7000 168287.8750 90
  260.8000 130267.9219 69
  260.9000 139251.3125 74
  261.0000 157976.8125 84
  261.1000 165270.4375 88
  261.2000 110852.7500 59
  261.3000 97817.3438 52
  261.4000 81023.0391 42
  261.9000 46606.7773 24
  263.0000 69884.3125 36
  263.1000 65211.5625 34
  263.2000 50451.8789 26
  263.3000 44813.5430 23
  268.3000 54469.4023 28
  268.4000 156631.8750 83
  268.5000 227861.1094 122
  268.6000 304211.3438 163
  268.7000 322574.7500 173
  268.8000 294038.2188 158
  268.9000 303125.0938 163
  269.0000 282847.7813 152
  269.1000 299176.5313 161
  269.2000 275467.9688 148
  269.3000 269657.2188 145
  269.4000 180581.8750 96
  269.5000 93230.8047 49
  269.6000 68504.8906 36
  269.7000 52831.3633 27
  269.8000 44675.6055 23
  269.9000 44072.1172 22
  270.0000 48710.3711 25
  270.1000 52072.6875 27
  270.4000 63573.5117 33
  270.5000 60987.1172 32
  270.6000 75505.3984 39
  270.7000 89368.4609 47
  270.8000 64245.9727 33
  270.9000 78729.7578 41
  271.0000 84850.8906 44
  271.1000 73056.9375 38
  271.2000 61866.4766 32
  271.3000 70625.7500 37
  278.3000 51262.2813 26
  278.4000 191686.0781 102
  278.5000 325661.1875 175
  278.6000 379440.8438 204
  278.7000 409080.9063 220
  278.8000 443600.6563 239
  278.9000 439048.6250 237
  279.0000 448428.5313 242
  279.1000 394735.0938 212
  279.2000 403890.9063 217
  279.3000 413822.6563 223
  279.4000 245258.8750 131
  279.5000 110007.8594 58
  279.6000 96989.6797 51
  279.7000 67935.8750 35
  279.8000 105628.2344 56
  279.9000 89437.4297 47
  280.0000 89368.4688 47
  280.1000 86006.1406 45
  280.2000 88971.8750 47
  280.3000 93437.6953 49
  280.4000 110870.0000 59
  280.5000 150321.0469 80
  280.6000 176909.1875 94
  280.7000 199376.3125 107
  280.8000 160459.7188 85
  280.9000 195220.8594 104
  281.0000 204066.2969 109
  281.1000 196479.5625 105
  281.2000 153993.7344 82
  281.3000 140354.8594 75
  281.4000 100248.5469 53
  281.5000 53986.6094 28
  281.6000 43985.9023 22
  296.3000 40916.7227 21
  296.4000 141665.2969 75
  296.5000 232913.1719 125
  296.6000 290744.8750 156
  296.7000 295538.3438 159
  296.8000 294089.9688 158
  296.9000 316108.8125 170
  297.0000 280744.1875 151
  297.1000 281313.1563 151
  297.2000 255121.6875 137
  297.3000 237241.0781 127
  297.4000 156752.5625 83
  297.5000 65332.2539 34
  297.6000 46968.8750 24
  297.7000 44658.3672 23
  297.8000 44623.8750 23
  297.9000 72056.8828 38
  298.0000 55659.1484 29
  298.1000 43934.1641 22
  298.2000 46106.7461 23
  298.3000 55055.6563 28
  298.4000 82367.9609 43
  298.5000 124008.8594 66
  298.6000 110766.5234 59
  298.7000 89868.4844 47
  298.8000 103041.8359 54
  298.9000 107438.6953 57
  299.0000 80402.2891 42
  299.1000 85506.1172 45
  299.2000 97006.9375 51
  299.3000 88299.4063 46
  337.5000 46072.2617 23
  339.9000 47279.2422 24
  364.6000 47796.5195 24
  364.7000 58435.2070 30
  364.8000 51710.5898 27
  364.9000 52434.7813 27
  365.0000 61590.6094 32
  365.1000 56314.3672 29
  365.2000 112439.0547 59
  365.3000 54555.6211 28
  382.3000 119560.2656 63
  382.4000 444428.2813 239
  382.5000 716740.8750 387
  382.6000 815351.3125 441
  382.7000 881235.3750 476
  382.8000 918772.5625 497
  382.9000 954137.1875 516
  383.0000 830438.6250 449
  383.1000 832835.3125 450
  383.2000 803919.3750 434
  383.3000 981139.0000 530
  383.4000 588800.6875 318
  383.5000 244241.6094 131
  383.6000 203669.7344 109
  383.7000 180185.2813 96
  383.8000 192030.9531 103
  383.9000 191668.8281 102
  384.0000 188392.7813 101
  384.1000 172305.3906 92
  384.2000 172788.1719 92
  384.3000 339351.8125 182
  384.4000 298297.1563 160
  384.5000 239327.4375 128
  384.6000 235637.5469 126
  384.7000 270691.7500 145
  384.8000 283365.0938 152
  384.9000 460498.4375 248
  385.0000 249035.0156 134
  385.1000 262622.2188 141
  385.2000 265743.1250 143
  385.3000 231740.7031 124
  385.4000 143751.6563 76
  385.5000 87161.3828 46
  385.6000 79591.8984 42
  385.7000 65849.5391 34
  385.8000 49572.5117 25
  385.9000 54365.9492 28
  386.0000 58607.6328 30
  386.1000 53003.7852 27
  386.2000 46399.8633 24
  386.3000 49848.3867 26
  399.3000 64746.0078 34
  399.4000 284106.4688 153
  399.5000 438548.5313 236
  399.6000 584903.7500 316
  399.7000 643615.0000 347
  399.8000 617888.8750 333
  399.9000 630338.0625 340
  400.0000 578817.1875 312
  400.1000 556815.7500 300
  400.2000 532227.6250 287
  400.3000 489603.9375 264
  400.4000 351732.0313 189
  400.5000 311608.5000 167
  400.6000 313418.9688 168
  400.7000 133233.6719 71
  400.8000 133319.8750 71
  400.9000 115766.8906 61
  401.0000 129923.0859 69
  401.1000 152010.8281 81
  401.2000 99886.4609 53
  401.3000 119180.9297 63
  401.4000 96662.0703 51
  401.5000 132940.5469 71
  401.6000 195238.0625 104
  401.7000 197065.7969 105
  401.8000 194996.6719 104
  401.9000 199583.2344 107
  402.0000 200307.3906 107
  402.1000 136906.3281 73
  402.2000 161321.8438 86
  402.3000 151924.6094 81
  402.4000 87782.1328 46
  402.5000 59142.1523 31
  402.6000 121801.7969 65
  402.7000 65246.0273 34
  402.8000 44279.0234 23
  402.9000 50727.7695 26
  403.0000 81040.2656 42
  423.4000 104386.7734 55
  423.5000 108990.5469 58
  423.6000 147303.6094 78
  423.7000 172374.3594 92
  423.8000 156424.9531 83
  423.9000 169977.6563 91
  424.0000 167305.0625 89
  424.1000 197100.2656 105
  424.2000 146148.3750 78
  424.3000 135302.7656 72
  424.4000 64073.5508 33
  424.5000 56038.4883 29
  424.6000 57797.2266 30
  424.7000 53072.7617 27
  424.8000 46589.5430 24
  424.9000 43313.4336 22
  425.0000 42830.6523 22
  425.2000 43192.7383 22
  425.3000 41071.9063 21
  425.5000 65935.7500 34
  425.6000 54762.5273 28
  425.7000 83402.5000 44
  425.8000 48762.1094 25
  425.9000 53590.0391 28
  426.0000 47279.2422 24
  426.1000 52452.0195 27
  426.2000 53727.9844 28
  764.2000 73160.3984 38
  764.3000 234844.3750 126
  764.4000 1094854.0000 592
  764.5000 1844597.3750 999
  764.6000 1165100.5000 630
  764.7000 976724.9375 528
  764.8000 860871.9375 465
  764.9000 867182.6875 469
  765.0000 836594.2500 452
  765.1000 755829.8750 408
  765.2000 674634.5625 364
  765.3000 462601.9688 249
  765.4000 335679.1250 180
  765.5000 348680.1250 188
  765.6000 396476.6250 213
  765.7000 741777.1250 401
  765.8000 642890.6875 347
  765.9000 476482.3125 257
  766.0000 434479.3125 234
  766.1000 443359.2188 239
  766.2000 830386.9375 449
  766.3000 355784.0000 191
  766.4000 487931.4063 263
  766.5000 579386.2500 313
  766.6000 589404.1250 318
  766.7000 647149.6875 349
  766.8000 633890.1250 342
  766.9000 737087.1250 398
  767.0000 653443.1875 353
  767.1000 612491.9375 331
  767.2000 525434.1250 283
  767.3000 336110.2188 181
  767.4000 261122.0469 140
  767.5000 219567.4219 118
  767.6000 313125.8125 168
  767.7000 268174.3438 144
  767.8000 309366.9063 166
  767.9000 292883.0000 157
  768.0000 297848.8438 160
  768.1000 284847.9688 153
  768.2000 251414.5156 135
  768.3000 174978.0313 93
  768.4000 121112.1016 64
  768.5000 133302.6406 71
  768.6000 186858.1875 100
  768.7000 226188.5625 121
  768.8000 179736.9688 96
  768.9000 189979.0938 101
  769.0000 153062.6563 81
  769.1000 192910.3125 103
  769.2000 360767.1250 194
  769.3000 143699.8906 76
  769.4000 56935.0977 29
  769.5000 48537.9492 25
  769.6000 45141.1484 23
  769.7000 62797.5938 33
  769.8000 56038.4883 29
  769.9000 53572.7891 28
  770.0000 43641.0469 22
  770.2000 48106.8828 25
  781.4000 45554.9805 23
  781.5000 60504.3242 31
  781.6000 101662.4297 54
  781.7000 113421.9063 60
  781.8000 90506.4688 48
  781.9000 94023.9688 49
  782.0000 85661.2891 45
  782.1000 86299.2578 45
  782.2000 79626.3750 42
  782.3000 69711.8828 36
  782.5000 46589.5391 24
  782.7000 42227.1563 21
  782.8000 50348.4219 26
  783.0000 60831.9297 31
  783.4000 49382.8398 25
  783.5000 61056.0938 32
  783.6000 68211.7656 35
  783.7000 82885.2344 43
  783.8000 83488.7266 44
  783.9000 117853.2422 62
  784.0000 259104.7344 139
  784.1000 83609.4297 44
  784.2000 49331.1133 25
  784.3000 52503.7500 27
  785.0000 46675.7461 24