ACCESSION: MSBNK-RIKEN_ReSpect-PS100507
RECORD_TITLE: DL-2-Hydroxyvaleric acid sodium salt hydrate, 2-hydroxy-pentanoic acid; LC-ESI-QQ; MS2
DATE: 2009.02.09
AUTHORS: Sawada Y, Matsuda F, and Hirai MY. Plant Science Center, RIKEN
LICENSE: CC BY-NC
COPYRIGHT: Copyright(C) 2008 Plant Science Center, RIKEN
PUBLICATION: Sawada, Y.; Akiyama, K.; Sakata, A.; Kuwahara, A.; Otsuki, H.; Sakurai, T.; Saito, K.; Hirai, M. Y. Widely Targeted Metabolomics Based on Large-Scale MS/MS Data for Elucidating Metabolite Accumulation Patterns in Plants. Plant and Cell Physiology 2008, 50 (1), 37–47. DOI:10.1093/pcp/pcn183
COMMENT: Build 5
COMMENT: Data acquisition and generation is financially supported in part by CREST/JST.
COMMENT: Source compound ACROS, 204950010.
COMMENT: PRIMe compound in-house ID N0063
COMMENT: This spectra was automatically generated from the raw data without manual curation of data quality.
COMMENT: The spectral data and services are available to the research and academic community only.
COMMENT: All users must cite follwing literature in publication(s).

CH$NAME: DL-2-Hydroxyvaleric acid sodium salt hydrate
CH$NAME: 2-hydroxy-pentanoic acid
CH$COMPOUND_CLASS: CLASS1 Other CLASS2 Carboxylic acid CLASS3 Valeric acid
CH$FORMULA: C5H10O3
CH$EXACT_MASS: 118.132
CH$SMILES: CCCC(C(=O)O)O
CH$IUPAC: InChI=1S/C5H10O3/c1-2-3-4(6)5(7)8/h4,6H,2-3H2,1H3,(H,7,8)
CH$LINK: CAS 617-31-2
CH$LINK: PUBCHEM CID:98009
CH$LINK: INCHIKEY JRHWHSJDIILJAT-UHFFFAOYSA-N

AC$INSTRUMENT: TQD, Waters
AC$INSTRUMENT_TYPE: LC-ESI-QQ
AC$MASS_SPECTROMETRY: MS_TYPE MS2
AC$MASS_SPECTROMETRY: ION_MODE NEGATIVE
AC$MASS_SPECTROMETRY: IONIZATION ESI
AC$MASS_SPECTROMETRY: COLLISION_ENERGY 10

MS$FOCUSED_ION: ION_TYPE [M-H]-
MS$FOCUSED_ION: PRECURSOR_M/Z 117.1

PK$SPLASH: splash10-014i-0900000000-752adb53c0515ffe6a45
PK$NUM_PEAK: 1
PK$PEAK: m/z int. rel.int.
  117.0 170910.0 999