ACCESSION: MSBNK-RIKEN_ReSpect-PT205850
RECORD_TITLE: D-Gluco-hexonic acid, Glucose Acid, 2,3,4,5,6-Pentahydroxycaproic acid, Sodium D-gluconate, Glonsen, D-Gluconic acid sodium salt, (2R,3S,4R,5R)-2,3,4,5,6-pentahydroxyhexanoic acid; LC-ESI-QTOF; MS2
DATE: 2008.07.28
AUTHORS: Matsuda F, Suzuki M, Sawada Y, Plant Science Center, RIKEN.
LICENSE: CC BY-NC
COPYRIGHT: Copyright(C) 2009 Plant Science Center, RIKEN
COMMENT: Build 1 2009/06/24
COMMENT: Acquisition and generation of the data is financially supported in part by CREST/JST.

CH$NAME: D-Gluco-hexonic acid
CH$NAME: Glucose Acid
CH$NAME: 2,3,4,5,6-Pentahydroxycaproic acid
CH$NAME: Sodium D-gluconate
CH$NAME: Glonsen
CH$NAME: D-Gluconic acid sodium salt
CH$NAME: (2R,3S,4R,5R)-2,3,4,5,6-pentahydroxyhexanoic acid
CH$COMPOUND_CLASS: CLASS1 Other CLASS2 Sugar CLASS3 Monosaccharide
CH$FORMULA: C6H12O7
CH$EXACT_MASS: 196.155
CH$SMILES: C(C(C(C(C(C(=O)O)O)O)O)O)O
CH$IUPAC: InChI=1S/C6H12O7/c7-1-2(8)3(9)4(10)5(11)6(12)13/h2-5,7-11H,1H2,(H,12,13)
CH$LINK: CAS 526-95-4
CH$LINK: INCHIKEY RGHNJXZEOKUKBD-UHFFFAOYSA-N

AC$INSTRUMENT: Q-Tof Premier, Waters
AC$INSTRUMENT_TYPE: LC-ESI-QTOF
AC$MASS_SPECTROMETRY: MS_TYPE MS2
AC$MASS_SPECTROMETRY: ION_MODE NEGATIVE
AC$MASS_SPECTROMETRY: IONIZATION ESI
AC$MASS_SPECTROMETRY: COLLISION_ENERGY Ramp 5-45 V
AC$MASS_SPECTROMETRY: CAPILLARY_VOLTAGE 3.0 kV
AC$CHROMATOGRAPHY: SOLVENT CH3CN/H2O

MS$FOCUSED_ION: ION_TYPE [M-H]-
MS$FOCUSED_ION: PRECURSOR_M/Z 195.0505

PK$SPLASH: splash10-004j-7900000000-9f71f12a7d69ca2b5224
PK$NUM_PEAK: 9
PK$PEAK: m/z int. rel.int.
  59.0153 20.71 71
  71.0149 24.69 84
  75.0096 226.9 776
  85.0304 23.67 81
  87.0081 44.13 151
  99.0085 72.34 247
  129.0188 158.4 542
  177.0404 14.82 51
  195.0505 292.0 999