ACCESSION: MSBNK-RIKEN_ReSpect-PT207560
RECORD_TITLE: Tartrate, 1,2-Dihydroxyethane-1,2-dicarboxylic acid, (2R,3R)-(+)-Tartaric acid, 2,3-Dihydroxybutanedioic acid, (2R,3R)-2,3-dihydroxybutanedioic acid, L-Threaric acid, L(+)-Tartaric acid, Dextrotartaric acid, L(+)-2,3-Dihydroxysuccinic Acid; LC-ESI-QTOF; MS2
DATE: 2008.07.28
AUTHORS: Matsuda F, Suzuki M, Sawada Y, Plant Science Center, RIKEN.
LICENSE: CC BY-NC
COPYRIGHT: Copyright(C) 2009 Plant Science Center, RIKEN
COMMENT: Build 1 2009/06/24
COMMENT: Acquisition and generation of the data is financially supported in part by CREST/JST.

CH$NAME: Tartrate
CH$NAME: 1,2-Dihydroxyethane-1,2-dicarboxylic acid
CH$NAME: (2R,3R)-(+)-Tartaric acid
CH$NAME: 2,3-Dihydroxybutanedioic acid
CH$NAME: (2R,3R)-2,3-dihydroxybutanedioic acid
CH$NAME: L-Threaric acid
CH$NAME: L(+)-Tartaric acid
CH$NAME: Dextrotartaric acid
CH$NAME: L(+)-2,3-Dihydroxysuccinic Acid
CH$COMPOUND_CLASS: CLASS1 Other CLASS2 Carboxylic acid CLASS3 Tartaric acid
CH$FORMULA: C4H6O6
CH$EXACT_MASS: 150.086
CH$SMILES: C(C(C(=O)O)O)(C(=O)O)O
CH$IUPAC: InChI=1S/C4H6O6/c5-1(3(7)8)2(6)4(9)10/h1-2,5-6H,(H,7,8)(H,9,10)
CH$LINK: CAS 87-69-4
CH$LINK: INCHIKEY FEWJPZIEWOKRBE-UHFFFAOYSA-N

AC$INSTRUMENT: Q-Tof Premier, Waters
AC$INSTRUMENT_TYPE: LC-ESI-QTOF
AC$MASS_SPECTROMETRY: MS_TYPE MS2
AC$MASS_SPECTROMETRY: ION_MODE NEGATIVE
AC$MASS_SPECTROMETRY: IONIZATION ESI
AC$MASS_SPECTROMETRY: COLLISION_ENERGY Ramp 5-45 V
AC$MASS_SPECTROMETRY: CAPILLARY_VOLTAGE 3.0 kV
AC$CHROMATOGRAPHY: SOLVENT CH3CN/H2O

MS$FOCUSED_ION: ION_TYPE [M-H]-
MS$FOCUSED_ION: PRECURSOR_M/Z 149.00864

PK$SPLASH: splash10-0002-5900000000-4c66eac9e5850c5fcbe4
PK$NUM_PEAK: 4
PK$PEAK: m/z int. rel.int.
  72.9936 17.0 274
  87.0099 32.5 523
  148.899 12.37 199
  149.0086 62.04 999