ACCESSION: MSBNK-Washington_State_Univ-BML81592
RECORD_TITLE: Leontiformine; LC-APCI-QTOF; MS; POSITIVE
DATE: 2016.01.19 (Created 2012.10.26)
AUTHORS: Cuthbertson DJ, Johnson SR, Lange BM, Institute of Biological Chemistry, Washington State University
LICENSE: CC BY-SA
COMMENT: relative retention time with respect to 9-anthracene Carboxylic Acid is 0.295

CH$NAME: Leontiformine
CH$COMPOUND_CLASS: N/A
CH$FORMULA: C15H26N2O
CH$EXACT_MASS: 250.204513
CH$SMILES: C1CCN2C[C@@H](CC[C@@H]2C1)[C@H]3CCCCN3C=O
CH$IUPAC: InChI=1S/C15H26N2O/c18-12-17-10-4-2-6-15(17)13-7-8-14-5-1-3-9-16(14)11-13/h12-15H,1-11H2/t13-,14+,15-/m1/s1
CH$LINK: CAS 29073-26-5
CH$LINK: CHEMSPIDER 391258
CH$LINK: PUBCHEM CID:442955
CH$LINK: INCHIKEY LUGPGVVCVOWJLT-QLFBSQMISA-N
CH$LINK: COMPTOX DTXSID50332020

AC$INSTRUMENT: Agilent 1200 RRLC; Agilent 6520 QTOF
AC$INSTRUMENT_TYPE: LC-APCI-QTOF
AC$MASS_SPECTROMETRY: MS_TYPE MS
AC$MASS_SPECTROMETRY: ION_MODE POSITIVE
AC$MASS_SPECTROMETRY: SCANNING m/z 100-1000
AC$CHROMATOGRAPHY: COLUMN_NAME Agilent C8 Cartridge Column 2.1X30mm 3.5 micron (guard); Agilent SB-Aq 2.1x50mm 1.8 micron (analytical)
AC$CHROMATOGRAPHY: COLUMN_TEMPERATURE 60 C
AC$CHROMATOGRAPHY: FLOW_GRADIENT linear from 98A/2B at 0 min to 2A/98B at 13 min, hold 6 min at 2A/98B, reequilibration 98A/2B (5 min)
AC$CHROMATOGRAPHY: FLOW_RATE 0.6 ml/min
AC$CHROMATOGRAPHY: RETENTION_TIME 2.183
AC$CHROMATOGRAPHY: SOLVENT A water with 0.2% acetic acid
AC$CHROMATOGRAPHY: SOLVENT B methanol with 0.2% acetic acid

PK$SPLASH: splash10-0udi-0090000000-04003b2c90c2ede4e79d
PK$NUM_PEAK: 1
PK$PEAK: m/z int. rel.int.
  251.2117765 3461111 999