ACCESSION: MSBNK-Washington_State_Univ-BML81981
RECORD_TITLE: Plumbagin; LC-ESI-QTOF; MS; NEGATIVE
DATE: 2016.01.19 (Created 2012.10.26)
AUTHORS: Cuthbertson DJ, Johnson SR, Lange BM, Institute of Biological Chemistry, Washington State University
LICENSE: CC BY-SA
COMMENT: relative retention time with respect to 9-anthracene Carboxylic Acid is 0.960

CH$NAME: Plumbagin
CH$COMPOUND_CLASS: N/A
CH$FORMULA: C11H8O3
CH$EXACT_MASS: 188.047344
CH$SMILES: CC1=CC(=O)C2=C(C1=O)C=CC=C2O
CH$IUPAC: InChI=1S/C11H8O3/c1-6-5-9(13)10-7(11(6)14)3-2-4-8(10)12/h2-5,12H,1H3
CH$LINK: CAS 481-42-5
CH$LINK: CHEMSPIDER 9790
CH$LINK: PUBCHEM CID:10205
CH$LINK: INCHIKEY VCMMXZQDRFWYSE-UHFFFAOYSA-N
CH$LINK: COMPTOX DTXSID8075413

AC$INSTRUMENT: Agilent 1200 RRLC; Agilent 6520 QTOF
AC$INSTRUMENT_TYPE: LC-ESI-QTOF
AC$MASS_SPECTROMETRY: MS_TYPE MS
AC$MASS_SPECTROMETRY: ION_MODE NEGATIVE
AC$MASS_SPECTROMETRY: SCANNING m/z 100-1000
AC$CHROMATOGRAPHY: COLUMN_NAME Agilent C8 Cartridge Column 2.1X30mm 3.5 micron (guard); Agilent SB-Aq 2.1x50mm 1.8 micron (analytical)
AC$CHROMATOGRAPHY: COLUMN_TEMPERATURE 60 C
AC$CHROMATOGRAPHY: FLOW_GRADIENT linear from 98A/2B at 0 min to 2A/98B at 13 min, hold 6 min at 2A/98B, reequilibration 98A/2B (5 min)
AC$CHROMATOGRAPHY: FLOW_RATE 0.6 ml/min
AC$CHROMATOGRAPHY: RETENTION_TIME 7.072
AC$CHROMATOGRAPHY: SOLVENT A water with 0.2% acetic acid
AC$CHROMATOGRAPHY: SOLVENT B methanol with 0.2% acetic acid

PK$SPLASH: splash10-000i-0900000000-81c88d2fb009e3b4ede9
PK$NUM_PEAK: 1
PK$PEAK: m/z int. rel.int.
  187.0400235 1447 999