ACCESSION: MSBNK-Washington_State_Univ-BML82155
RECORD_TITLE: Securinine; LC-ESI-QTOF; MS; POSITIVE
DATE: 2016.01.19 (Created 2012.10.26)
AUTHORS: Cuthbertson DJ, Johnson SR, Lange BM, Institute of Biological Chemistry, Washington State University
LICENSE: CC BY-SA
COMMENT: relative retention time with respect to 9-anthracene Carboxylic Acid is 0.052

CH$NAME: Securinine
CH$COMPOUND_CLASS: N/A
CH$FORMULA: C13H15NO2
CH$EXACT_MASS: 217.110279
CH$SMILES: C1CCN2[C@H](C1)[C@]34C[C@H]2C=CC3=CC(=O)O4
CH$IUPAC: InChI=1S/C13H15NO2/c15-12-7-9-4-5-10-8-13(9,16-12)11-3-1-2-6-14(10)11/h4-5,7,10-11H,1-3,6,8H2/t10-,11-,13+/m1/s1
CH$LINK: CAS 5610-40-2
CH$LINK: CHEMSPIDER 391181
CH$LINK: PUBCHEM CID:442872
CH$LINK: INCHIKEY SWZMSZQQJRKFBP-WZRBSPASSA-N
CH$LINK: COMPTOX DTXSID7045944

AC$INSTRUMENT: Agilent 1200 RRLC; Agilent 6520 QTOF
AC$INSTRUMENT_TYPE: LC-ESI-QTOF
AC$MASS_SPECTROMETRY: MS_TYPE MS
AC$MASS_SPECTROMETRY: ION_MODE POSITIVE
AC$MASS_SPECTROMETRY: SCANNING m/z 100-1000
AC$CHROMATOGRAPHY: COLUMN_NAME Agilent C8 Cartridge Column 2.1X30mm 3.5 micron (guard); Agilent SB-Aq 2.1x50mm 1.8 micron (analytical)
AC$CHROMATOGRAPHY: COLUMN_TEMPERATURE 60 C
AC$CHROMATOGRAPHY: FLOW_GRADIENT linear from 98A/2B at 0 min to 2A/98B at 13 min, hold 6 min at 2A/98B, reequilibration 98A/2B (5 min)
AC$CHROMATOGRAPHY: FLOW_RATE 0.6 ml/min
AC$CHROMATOGRAPHY: RETENTION_TIME 0.387
AC$CHROMATOGRAPHY: SOLVENT A water with 0.2% acetic acid
AC$CHROMATOGRAPHY: SOLVENT B methanol with 0.2% acetic acid

PK$SPLASH: splash10-014i-0090000000-fe00f4fdc9f4060a3a30
PK$NUM_PEAK: 1
PK$PEAK: m/z int. rel.int.
  218.1175765 1939595 999