ACCESSION: MSBNK-Waters-WA000294
RECORD_TITLE: Sertraline; LC-ESI-Q; MS; POS; 15 V
DATE: 2016.01.19 (Created 2007.08.01, modified 2011.05.06)
AUTHORS: Nihon Waters K.K.
LICENSE: CC BY-NC

CH$NAME: Sertraline
CH$COMPOUND_CLASS: N/A
CH$FORMULA: C17H17Cl2N
CH$EXACT_MASS: 305.07380
CH$SMILES: CNC(C2)c(c3)c(ccc3)C(C2)c(c1)cc(Cl)c(Cl)c1
CH$IUPAC: InChI=1S/C17H17Cl2N/c1-20-17-9-7-12(13-4-2-3-5-14(13)17)11-6-8-15(18)16(19)10-11/h2-6,8,10,12,17,20H,7,9H2,1H3/t12-,17-/m0/s1
CH$LINK: CAS 79617-96-2
CH$LINK: INCHIKEY VGKDLMBJGBXTGI-SJCJKPOMSA-N
CH$LINK: COMPTOX DTXSID6023577

AC$INSTRUMENT: ZQ, Waters
AC$INSTRUMENT_TYPE: LC-ESI-Q
AC$MASS_SPECTROMETRY: MS_TYPE MS
AC$MASS_SPECTROMETRY: ION_MODE POSITIVE
AC$MASS_SPECTROMETRY: IONIZATION ESI
AC$CHROMATOGRAPHY: RETENTION_TIME 14.700 min
AC$CHROMATOGRAPHY: COLUMN_NAME 2.1 mm id - 3. 5{mu}m XTerra C18MS
AC$CHROMATOGRAPHY: COLUMN_TEMPERATURE 35 C
AC$CHROMATOGRAPHY: SAMPLING_CONE 15 V

MS$DATA_PROCESSING: FIND_PEAK ignore rel.int. < 5

PK$SPLASH: splash10-0a4i-0029000000-2221824b821010392587
PK$NUM_PEAK: 19
PK$PEAK: m/z int. rel.int.
  191 24 24
  241 31 31
  242 8 8
  266 12 12
  272 125 125
  273 12 12
  274 20 20
  275 188 188
  276 24 24
  277 121 121
  278 8 8
  279 16 16
  288 12 12
  306 999 999
  307 145 145
  308 682 682
  309 110 110
  310 118 118
  311 16 16