ACCESSION: MSBNK-Waters-WA001599
RECORD_TITLE: Carbimazole; LC-ESI-Q; MS; POS; 30 V
DATE: 2016.01.19 (Created 2007.08.01, modified 2011.05.06)
AUTHORS: Nihon Waters K.K.
LICENSE: CC BY-NC

CH$NAME: Carbimazole
CH$COMPOUND_CLASS: N/A
CH$FORMULA: C7H10N2O2S
CH$EXACT_MASS: 186.04630
CH$SMILES: CCOC(=O)N(C=1)C(=S)N(C)C1
CH$IUPAC: InChI=1S/C7H10N2O2S/c1-3-11-7(10)9-5-4-8(2)6(9)12/h4-5H,3H2,1-2H3
CH$LINK: CAS 22232-54-8
CH$LINK: INCHIKEY CFOYWRHIYXMDOT-UHFFFAOYSA-N
CH$LINK: COMPTOX DTXSID9022736

AC$INSTRUMENT: ZQ, Waters
AC$INSTRUMENT_TYPE: LC-ESI-Q
AC$MASS_SPECTROMETRY: MS_TYPE MS
AC$MASS_SPECTROMETRY: ION_MODE POSITIVE
AC$MASS_SPECTROMETRY: IONIZATION ESI
AC$CHROMATOGRAPHY: RETENTION_TIME 11.590 min
AC$CHROMATOGRAPHY: COLUMN_NAME 2.1 mm id - 3. 5{mu}m XTerra C18MS
AC$CHROMATOGRAPHY: COLUMN_TEMPERATURE 35 C
AC$CHROMATOGRAPHY: SAMPLING_CONE 30 V

MS$DATA_PROCESSING: FIND_PEAK ignore rel.int. < 5

PK$SPLASH: splash10-014i-0900000000-57bff7f1586f159f9f8a
PK$NUM_PEAK: 20
PK$PEAK: m/z int. rel.int.
  83 82 82
  88 27 27
  99 16 16
  111 20 20
  113 8 8
  115 999 999
  116 39 39
  117 43 43
  127 12 12
  143 255 255
  144 16 16
  145 12 12
  155 8 8
  159 39 39
  171 12 12
  187 243 243
  188 20 20
  189 16 16
  209 27 27
  225 8 8