ACCESSION: MSBNK-Waters-WA001953
RECORD_TITLE: Captopril; LC-ESI-Q; MS; POS; 60 V
DATE: 2016.01.19 (Created 2007.08.01, modified 2011.05.06)
AUTHORS: Nihon Waters K.K.
LICENSE: CC BY-NC

CH$NAME: Captopril
CH$COMPOUND_CLASS: N/A
CH$FORMULA: C9H15NO3S
CH$EXACT_MASS: 217.07726
CH$SMILES: SCC(C)C(=O)N(C1)C(CC1)C(O)=O
CH$IUPAC: InChI=1S/C9H15NO3S/c1-6(5-14)8(11)10-4-2-3-7(10)9(12)13/h6-7,14H,2-5H2,1H3,(H,12,13)/t6-,7+/m1/s1
CH$LINK: CAS 62571-86-2
CH$LINK: INCHIKEY FAKRSMQSSFJEIM-RQJHMYQMSA-N
CH$LINK: COMPTOX DTXSID1037197

AC$INSTRUMENT: ZQ, Waters
AC$INSTRUMENT_TYPE: LC-ESI-Q
AC$MASS_SPECTROMETRY: MS_TYPE MS
AC$MASS_SPECTROMETRY: ION_MODE POSITIVE
AC$MASS_SPECTROMETRY: IONIZATION ESI
AC$CHROMATOGRAPHY: RETENTION_TIME 11.690 min
AC$CHROMATOGRAPHY: COLUMN_NAME 2.1 mm id - 3. 5{mu}m XTerra C18MS
AC$CHROMATOGRAPHY: COLUMN_TEMPERATURE 35 C
AC$CHROMATOGRAPHY: SAMPLING_CONE 60 V

MS$DATA_PROCESSING: FIND_PEAK ignore rel.int. < 5

PK$SPLASH: splash10-014i-0920000000-9573cde0189fbb27ca62
PK$NUM_PEAK: 25
PK$PEAK: m/z int. rel.int.
  101 8 8
  103 8 8
  106 8 8
  109 8 8
  111 94 94
  112 8 8
  114 31 31
  116 999 999
  117 27 27
  121 20 20
  133 8 8
  143 8 8
  157 27 27
  158 8 8
  160 24 24
  172 16 16
  174 8 8
  216 12 12
  217 12 12
  218 12 12
  240 102 102
  241 16 16
  256 39 39
  262 161 161
  263 12 12