ACCESSION: MSBNK-Waters-WA002249
RECORD_TITLE: Haloperidol; LC-ESI-Q; MS; POS; 90 V
DATE: 2016.01.19 (Created 2007.08.01, modified 2011.05.06)
AUTHORS: Nihon Waters K.K.
LICENSE: CC BY-NC

CH$NAME: Haloperidol
CH$COMPOUND_CLASS: N/A
CH$FORMULA: C21H23ClFNO2
CH$EXACT_MASS: 375.14013
CH$SMILES: Fc(c3)ccc(c3)C(=O)CCCN(C2)CCC(O)(C2)c(c1)ccc(Cl)c1
CH$IUPAC: InChI=1S/C21H23ClFNO2/c22-18-7-5-17(6-8-18)21(26)11-14-24(15-12-21)13-1-2-20(25)16-3-9-19(23)10-4-16/h3-10,26H,1-2,11-15H2
CH$LINK: CAS 52-86-8
CH$LINK: INCHIKEY LNEPOXFFQSENCJ-UHFFFAOYSA-N
CH$LINK: COMPTOX DTXSID4034150

AC$INSTRUMENT: ZQ, Waters
AC$INSTRUMENT_TYPE: LC-ESI-Q
AC$MASS_SPECTROMETRY: MS_TYPE MS
AC$MASS_SPECTROMETRY: ION_MODE POSITIVE
AC$MASS_SPECTROMETRY: IONIZATION ESI
AC$CHROMATOGRAPHY: RETENTION_TIME 14.800 min
AC$CHROMATOGRAPHY: COLUMN_NAME 2.1 mm id - 3. 5{mu}m XTerra C18MS
AC$CHROMATOGRAPHY: COLUMN_TEMPERATURE 35 C
AC$CHROMATOGRAPHY: SAMPLING_CONE 90 V

MS$DATA_PROCESSING: FIND_PEAK ignore rel.int. < 5

PK$SPLASH: splash10-000i-0900000000-e37829a45420250e9950
PK$NUM_PEAK: 19
PK$PEAK: m/z int. rel.int.
  111 114 114
  113 39 39
  125 20 20
  127 8 8
  129 51 51
  130 8 8
  131 16 16
  137 8 8
  139 999 999
  140 35 35
  141 392 392
  142 20 20
  152 31 31
  154 12 12
  181 98 98
  182 8 8
  183 35 35
  198 20 20
  222 8 8