ACCESSION: MSBNK-Waters-WA002993
RECORD_TITLE: Cefuroxime; LC-ESI-Q; MS; NEG; 45 V
DATE: 2016.01.19 (Created 2007.08.01, modified 2011.05.06)
AUTHORS: Nihon Waters K.K.
LICENSE: CC BY-NC

CH$NAME: Cefuroxime
CH$COMPOUND_CLASS: N/A
CH$FORMULA: C16H16N4O8S
CH$EXACT_MASS: 424.06888
CH$SMILES: CO/N=C(/C1=CC=CO1)\C(=O)N[C@H]2[C@@H]3N(C2=O)C(=C(CS3)COC(=O)N)C(=O)O
CH$IUPAC: InChI=1S/C16H16N4O8S/c1-26-19-9(8-3-2-4-27-8)12(21)18-10-13(22)20-11(15(23)24)7(5-28-16(17)25)6-29-14(10)20/h2-4,10,14H,5-6H2,1H3,(H2,17,25)(H,18,21)(H,23,24)/b19-9-/t10-,14-/m1/s1
CH$LINK: CAS 55268-75-2
CH$LINK: INCHIKEY JFPVXVDWJQMJEE-IZRZKJBUSA-N
CH$LINK: PUBCHEM CID:5479529

AC$INSTRUMENT: ZQ, Waters
AC$INSTRUMENT_TYPE: LC-ESI-Q
AC$MASS_SPECTROMETRY: MS_TYPE MS
AC$MASS_SPECTROMETRY: ION_MODE NEGATIVE
AC$MASS_SPECTROMETRY: IONIZATION ESI
AC$CHROMATOGRAPHY: RETENTION_TIME 11.420 min
AC$CHROMATOGRAPHY: COLUMN_NAME 2.1 mm id - 3. 5{mu}m XTerra C18MS
AC$CHROMATOGRAPHY: COLUMN_TEMPERATURE 35 C
AC$CHROMATOGRAPHY: SAMPLING_CONE 45 V

MS$DATA_PROCESSING: FIND_PEAK ignore rel.int. < 5

PK$SPLASH: splash10-0a4i-0293200000-2a3f0e3be3a86cb88690
PK$NUM_PEAK: 78
PK$PEAK: m/z int. rel.int.
  100 8 8
  104 8 8
  105 8 8
  108 20 20
  109 71 71
  110 16 16
  116 78 78
  117 16 16
  122 8 8
  124 20 20
  128 8 8
  132 8 8
  133 12 12
  134 8 8
  140 16 16
  141 8 8
  150 24 24
  151 8 8
  160 12 12
  162 8 8
  163 12 12
  165 43 43
  166 8 8
  167 12 12
  168 20 20
  169 8 8
  172 8 8
  176 55 55
  177 16 16
  183 12 12
  193 31 31
  194 16 16
  195 35 35
  203 8 8
  207 999 999
  208 125 125
  209 20 20
  210 12 12
  211 27 27
  215 16 16
  224 8 8
  225 55 55
  226 8 8
  227 8 8
  232 39 39
  233 12 12
  234 63 63
  235 8 8
  246 8 8
  248 8 8
  251 31 31
  252 12 12
  253 55 55
  254 12 12
  258 16 16
  274 24 24
  284 388 388
  285 71 71
  286 8 8
  290 27 27
  291 8 8
  304 8 8
  318 345 345
  319 67 67
  320 20 20
  336 125 125
  337 16 16
  362 106 106
  363 16 16
  379 8 8
  380 20 20
  384 16 16
  400 12 12
  402 8 8
  423 435 435
  424 98 98
  425 35 35
  426 8 8