ACCESSION: MSBNK-MSSJ-MSJ00256
RECORD_TITLE: Quinoclamine; ESI-QTOF; MS; NEGATIVE
DATE: 2020.03.18
AUTHORS: Atsushi Yamamoto, Faculty of Environmental Studies, Tottori University of Environmental Studies, 1-1, Wakabadai-kita, Tottori City, Tottori 689-1111, Japan.
LICENSE: CC BY
COPYRIGHT: Atsushi Yamamoto, Faculty of Environmental Studies, Tottori University of Environmental Studies, 1-1, Wakabadai-kita, Tottori City, Tottori 689-1111, Japan.
COMMENT: The sample was injected by direct infusion.
COMMENT: This record was created by the financial support of MEXT/JSPS KAKENHI Grant Number 19HP8024 to the Mass Spectrometry Society of Japan.

CH$NAME: Quinoclamine
CH$COMPOUND_CLASS: Non-natural product
CH$FORMULA: C10H6ClNO2
CH$EXACT_MASS: 207.0087
CH$SMILES: c1ccc2c(c1)C(=O)C(=C(C2=O)Cl)N
CH$IUPAC: InChI=1S/C10H6ClNO2/c11-7-8(12)10(14)6-4-2-1-3-5(6)9(7)13/h1-4H,12H2
CH$LINK: CAS 2797-51-5
CH$LINK: CHEMSPIDER 16770
CH$LINK: INCHIKEY OBLNWSCLAYSJJR-UHFFFAOYSA-N
CH$LINK: PUBCHEM CID:17748

AC$INSTRUMENT: X500R QTOF (AB Sciex LLC, USA)
AC$INSTRUMENT_TYPE: ESI-QTOF
AC$MASS_SPECTROMETRY: MS_TYPE MS
AC$MASS_SPECTROMETRY: ION_MODE NEGATIVE
AC$MASS_SPECTROMETRY: IONIZATION ESI

PK$SPLASH: splash10-0a4i-0190000000-b3e948a6a204d8992103
PK$NUM_PEAK: 19
PK$PEAK: m/z int. rel.int.
  149.06 99.009 230
  157.1226 27.116 63
  171.1381 35.373 82
  199.1693 25.088 58
  206 430.116 999
  206.9844 101.321 235
  207.0041 72.652 169
  207.9972 158.674 369
  208.9816 36.217 84
  212.0739 36.126 84
  218.1664 38.712 90
  219.174 63.931 148
  220.1456 71.797 167
  223.0271 24.804 58
  227.2003 37.896 88
  241.216 24.185 56
  253.2159 32.545 76
  255.2315 97.569 227
  281.2471 32.406 75