ACCESSION: MSBNK-Nihon_Univ-NU000456
RECORD_TITLE: 6b-Hydroxy-5b-cholan-24-oic acid; LC-ESI-TOF; MS; Negative; Orifice voltage -30 V
DATE: 2016.01.19 (Created 2015.02.04)
AUTHORS: Takashi Iida, Department of Chemistry, College of Humanities and Sciences, Nihon University
LICENSE: CC BY
COPYRIGHT: Copyright (C) Takashi Iida, Department of Chemistry, College of Humanities and Sciences, Nihon University
COMMENT: [Analytical] Sample of 1 micorL methanol solution was flow injected.
COMMENT: [Mass_spectrometry] Sampling interval 1 Hz

CH$NAME: 6b-Hydroxy-5b-cholan-24-oic acid
CH$COMPOUND_CLASS: Natural Product; Bile acid
CH$FORMULA: C24H40O3
CH$EXACT_MASS: 376.29775
CH$SMILES: C[C@H](CCC(=O)O)[C@H]1CC[C@@H]2[C@@]1(CC[C@H]3[C@H]2C[C@H]([C@H]4[C@@]3(CCCC4)C)O)C
CH$IUPAC: InChI=1S/C24H40O3/c1-15(7-10-22(26)27)17-8-9-18-16-14-21(25)20-6-4-5-12-23(20,2)19(16)11-13-24(17,18)3/h15-21,25H,4-14H2,1-3H3,(H,26,27)/t15-,16+,17-,18+,19+,20+,21-,23-,24-/m1/s1
CH$LINK: CHEMSPIDER 4446893
CH$LINK: INCHIKEY AOZMFMMOEOBOTA-YVHYCUFNSA-N
CH$LINK: LIPIDBANK BBA0008

AC$INSTRUMENT: JMS-T100LP, JEOL
AC$INSTRUMENT_TYPE: LC-ESI-TOF
AC$MASS_SPECTROMETRY: MS_TYPE MS
AC$MASS_SPECTROMETRY: ION_MODE NEGATIVE
AC$MASS_SPECTROMETRY: DESOLVATION_TEMPERATURE 250 C
AC$MASS_SPECTROMETRY: ION_GUIDE_VOLTAGE 1500 V
AC$MASS_SPECTROMETRY: IONIZATION ESI
AC$MASS_SPECTROMETRY: MASS_RANGE_M/Z 100-1000
AC$MASS_SPECTROMETRY: NEBULIZER N2
AC$MASS_SPECTROMETRY: NEEDLE_VOLTAGE -2000 V
AC$MASS_SPECTROMETRY: ORIFICE_TEMP 80 C
AC$MASS_SPECTROMETRY: ORIFICE_VOLTAGE -30 V
AC$MASS_SPECTROMETRY: RING_VOLTAGE -10

PK$SPLASH: splash10-03k9-7900000000-f08c0d5c1e718f80f9b4
PK$NUM_PEAK: 15
PK$PEAK: m/z int. rel.int.
  58.95937 2.0807 21
  61.93523 5.6993 57
  68.94737 26.8844 269
  74.96447 50.1526 501
  75.96899 1.4833 15
  84.98771 3.2663 33
  112.96096 100 999
  113.62504 0.6894 7
  113.96444 2.1696 22
  128.99719 1.2344 12
  212.0698 3.7089 37
  227.00395 1.0271 10
  248.95768 2.0045 20
  375.28741 5.7795 58
  376.29356 1.7449 17