ACCESSION: MSBNK-Nihon_Univ-NU000492
RECORD_TITLE: 3a,6b,7a-Trihydroxy-5b-cholan-24-oic acid; LC-ESI-TOF; MS; Orifice voltage -60 V; Negative; In-suorce decay
DATE: 2016.01.12
AUTHORS: Takashi Iida, Department of Chemistry, College of Humanities and Sciences, Nihon University
LICENSE: CC BY
COPYRIGHT: Copyright (C) Takashi Iida, Department of Chemistry, College of Humanities and Sciences, Nihon University
COMMENT: [Analytical] Sample of 1 micorL methanol solution was flow injected.
COMMENT: [Mass_spectrometry] Sampling interval 1 Hz
COMMENT: In-suorce decay

CH$NAME: 3a,6b,7a-Trihydroxy-5b-cholan-24-oic acid
CH$NAME: alpha-Muricholic acid
CH$COMPOUND_CLASS: Natural Product; Bile acid
CH$FORMULA: C24H40O5
CH$EXACT_MASS: 408.28757
CH$SMILES: C[C@H](CCC(=O)O)[C@H]1CC[C@@H]2[C@@]1(CC[C@H]3[C@H]2[C@@H]([C@H]([C@H]4[C@@]3(CC[C@H](C4)O)C)O)O)C
CH$IUPAC: InChI=1S/C24H40O5/c1-13(4-7-19(26)27)15-5-6-16-20-17(9-11-23(15,16)2)24(3)10-8-14(25)12-18(24)21(28)22(20)29/h13-18,20-22,25,28-29H,4-12H2,1-3H3,(H,26,27)/t13-,14-,15-,16+,17+,18+,20+,21+,22+,23-,24-/m1/s1
CH$LINK: CHEMSPIDER 4446940
CH$LINK: INCHIKEY DKPMWHFRUGMUKF-GDYCBZMLSA-N
CH$LINK: LIPIDBANK BBA0066
CH$LINK: PUBCHEM CID:5283852

AC$INSTRUMENT: JMS-T100LP, JEOL
AC$INSTRUMENT_TYPE: LC-ESI-TOF
AC$MASS_SPECTROMETRY: MS_TYPE MS
AC$MASS_SPECTROMETRY: ION_MODE NEGATIVE
AC$MASS_SPECTROMETRY: DESOLVATION_TEMPERATURE 250 C
AC$MASS_SPECTROMETRY: ION_GUIDE_VOLTAGE 1500 V
AC$MASS_SPECTROMETRY: IONIZATION ESI
AC$MASS_SPECTROMETRY: MASS_RANGE_M/Z 100-1000
AC$MASS_SPECTROMETRY: NEBULIZER N2
AC$MASS_SPECTROMETRY: NEEDLE_VOLTAGE -2000 V
AC$MASS_SPECTROMETRY: ORIFICE_TEMP 80 C
AC$MASS_SPECTROMETRY: ORIFICE_VOLTAGE -60 V
AC$MASS_SPECTROMETRY: RING_VOLTAGE -10

PK$SPLASH: splash10-014i-9100300000-91082a9d0e562c5ecb06
PK$NUM_PEAK: 22
PK$PEAK: m/z int. rel.int.
  59.02963 2.1 21
  61.00214 1.6 16
  62.00298 3.0 30
  69.008 100.0 999
  69.54672 0.5 5
  73.01725 1.5 15
  78.96747 4.4 44
  112.98769 10.0 100
  125.00261 2.4 24
  153.03176 2.1 21
  154.9736 5.0 50
  187.00293 1.1 11
  248.96078 3.5 35
  407.28325 21.1 211
  408.28664 5.8 58
  429.26833 2.5 25
  439.31034 13.0 130
  440.31448 3.7 37
  815.57558 3.7 37
  816.58994 2.0 20
  837.56133 3.6 36
  838.57056 1.9 19