ACCESSION: MSBNK-Nihon_Univ-NU000705
RECORD_TITLE: 6-Oxo-5a-cholan-24-oic acid; LC-ESI-TOF; MS; NEGATIVE; in source decay -150 V
DATE: 2018.02.26
AUTHORS: Takashi Iida, Department of Chemistry, College of Humanities and Sciences, Nihon University
LICENSE: CC BY
COPYRIGHT: Takashi Iida, Department of Chemistry, College of Humanities and Sciences, Nihon University
COMMENT: BA-121-150. In-source decay
COMMENT: 1 microL of the bile acid in MeOH solution was flow injected. Sampling interval was 1 Hz.
COMMENT: This record was created by the financial support of MEXT/JSPS KAKENHI Grant Number 17HP8021 (2017) to the MassBank database committee of the Mass Spectrometry Society of Japan.

CH$NAME: 6-Oxo-5a-cholan-24-oic acid
CH$COMPOUND_CLASS: Natural Product; Bile acids
CH$FORMULA: C24H38O3
CH$EXACT_MASS: 374.2821
CH$SMILES: C[C@H](CCC(=O)O)[C@H]1CC[C@@H]2[C@@]1(CC[C@H]3[C@H]2CC(=O)[C@@H]4[C@@]3(CCCC4)C)C
CH$IUPAC: InChI=1S/C24H38O3/c1-15(7-10-22(26)27)17-8-9-18-16-14-21(25)20-6-4-5-12-23(20,2)19(16)11-13-24(17,18)3/h15-20H,4-14H2,1-3H3,(H,26,27)/t15-,16+,17-,18+,19+,20-,23-,24-/m1/s1
CH$LINK: CHEMSPIDER 4446997
CH$LINK: INCHIKEY WIYCLWGXUJWTBW-CTICWCIZSA-N
CH$LINK: LIPIDBANK BBA0130
CH$LINK: PUBCHEM CID:5283909

AC$INSTRUMENT: JMS-T100LP, JEOL
AC$INSTRUMENT_TYPE: LC-ESI-TOF
AC$MASS_SPECTROMETRY: MS_TYPE MS
AC$MASS_SPECTROMETRY: ION_MODE NEGATIVE
AC$MASS_SPECTROMETRY: IONIZATION ESI
AC$MASS_SPECTROMETRY: ORIFICE_TEMPERATURE 80 C
AC$MASS_SPECTROMETRY: ORIFICE_VOLTAGE -150 V
AC$MASS_SPECTROMETRY: SCAN_RANGE_M/Z 100-1000

PK$SPLASH: splash10-00di-0009102400-68fcb2cc21b52baf19d3
PK$NUM_PEAK: 23
PK$PEAK: m/z int. rel.int.
  79.94 6 55
  373.27 100 999
  374.28 26 257
  383.90 12 122
  389.29 5 54
  409.26 7 66
  418.73 5 51
  496.07 7 66
  623.99 5 55
  641.43 5 51
  651.12 5 51
  669.12 5 51
  680.28 6 58
  688.03 10 98
  715.18 6 62
  747.56 20 203
  748.57 12 124
  759.59 9 89
  769.55 12 119
  770.54 6 64
  833.70 7 73
  911.57 6 57
  934.58 9 89