ACCESSION: MSBNK-Nihon_Univ-NU000716
RECORD_TITLE: 3,6-Dioxo-5a-cholan-24-oic acid; LC-ESI-TOF; MS; NEGATIVE; in source decay -30 V
DATE: 2018.02.26
AUTHORS: Takashi Iida, Department of Chemistry, College of Humanities and Sciences, Nihon University
LICENSE: CC BY
COPYRIGHT: Takashi Iida, Department of Chemistry, College of Humanities and Sciences, Nihon University
COMMENT: BA-124-30. In-source decay
COMMENT: 1 microL of the bile acid in MeOH solution was flow injected. Sampling interval was 1 Hz.
COMMENT: This record was created by the financial support of MEXT/JSPS KAKENHI Grant Number 17HP8021 (2017) to the MassBank database committee of the Mass Spectrometry Society of Japan.

CH$NAME: 3,6-Dioxo-5a-cholan-24-oic acid
CH$COMPOUND_CLASS: Natural Product; Bile acids
CH$FORMULA: C24H36O4
CH$EXACT_MASS: 388.26135
CH$SMILES: CC(CCC(=O)O)C1CCC2C1(CCC3C2CC(=O)C4C3(CCC(=O)C4)C)C
CH$IUPAC: InChI=1S/C24H36O4/c1-14(4-7-22(27)28)17-5-6-18-16-13-21(26)20-12-15(25)8-10-24(20,3)19(16)9-11-23(17,18)2/h14,16-20H,4-13H2,1-3H3,(H,27,28)/t14-,16+,17-,18+,19+,20-,23-,24-/m1/s1
CH$LINK: CHEMSPIDER 4447001
CH$LINK: INCHIKEY AWINBLVINXVKTE-DLKBGQMWSA-N
CH$LINK: LIPIDBANK BBA0135
CH$LINK: PUBCHEM CID:5283913

AC$INSTRUMENT: JMS-T100LP, JEOL
AC$INSTRUMENT_TYPE: LC-ESI-TOF
AC$MASS_SPECTROMETRY: MS_TYPE MS
AC$MASS_SPECTROMETRY: ION_MODE NEGATIVE
AC$MASS_SPECTROMETRY: IONIZATION ESI
AC$MASS_SPECTROMETRY: ORIFICE_TEMPERATURE 80 C
AC$MASS_SPECTROMETRY: ORIFICE_VOLTAGE -30 V
AC$MASS_SPECTROMETRY: SCAN_RANGE_M/Z 100-1000

PK$SPLASH: splash10-03dr-9701320100-e180d9fcc338ab7ed290
PK$NUM_PEAK: 23
PK$PEAK: m/z int. rel.int.
  59.00 4 41
  61.97 8 79
  68.98 36 356
  74.99 6 55
  89.01 58 582
  96.95 4 43
  112.97 100 999
  387.26 12 124
  388.26 4 36
  419.28 5 46
  423.23 10 102
  424.25 4 36
  425.23 4 43
  433.27 3 31
  477.28 14 141
  478.30 5 48
  501.25 18 176
  502.27 10 99
  509.33 3 31
  775.54 8 76
  776.54 7 72
  807.54 4 39
  811.51 5 46