ACCESSION: MSBNK-Nihon_Univ-NU000733
RECORD_TITLE: 7,12-Dioxo-5a-cholan-24-oic acid; LC-ESI-TOF; MS; NEGATIVE; in source decay -90 V
DATE: 2018.02.26
AUTHORS: Takashi Iida, Department of Chemistry, College of Humanities and Sciences, Nihon University
LICENSE: CC BY
COPYRIGHT: Takashi Iida, Department of Chemistry, College of Humanities and Sciences, Nihon University
COMMENT: BA-127-90. In-source decay
COMMENT: 1 microL of the bile acid in MeOH solution was flow injected. Sampling interval was 1 Hz.
COMMENT: This record was created by the financial support of MEXT/JSPS KAKENHI Grant Number 17HP8021 (2017) to the MassBank database committee of the Mass Spectrometry Society of Japan.

CH$NAME: 7,12-Dioxo-5a-cholan-24-oic acid
CH$COMPOUND_CLASS: Natural Product; Bile acids
CH$FORMULA: C24H36O4
CH$EXACT_MASS: 388.26135
CH$SMILES: CC(CCC(=O)O)C1CCC2C1(C(=O)CC3C2C(=O)CC4C3(CCCC4)C)C
CH$IUPAC: InChI=1S/C24H36O4/c1-14(7-10-21(27)28)16-8-9-17-22-18(13-20(26)24(16,17)3)23(2)11-5-4-6-15(23)12-19(22)25/h14-18,22H,4-13H2,1-3H3,(H,27,28)/t14-,15-,16-,17+,18+,22+,23+,24-/m1/s1
CH$LINK: CHEMSPIDER 4447005
CH$LINK: INCHIKEY WHQYZHCEDYYAAN-RHOMOTLWSA-N
CH$LINK: LIPIDBANK BBA0141
CH$LINK: PUBCHEM CID:5283917

AC$INSTRUMENT: JMS-T100LP, JEOL
AC$INSTRUMENT_TYPE: LC-ESI-TOF
AC$MASS_SPECTROMETRY: MS_TYPE MS
AC$MASS_SPECTROMETRY: ION_MODE NEGATIVE
AC$MASS_SPECTROMETRY: IONIZATION ESI
AC$MASS_SPECTROMETRY: ORIFICE_TEMPERATURE 80 C
AC$MASS_SPECTROMETRY: ORIFICE_VOLTAGE -90 V
AC$MASS_SPECTROMETRY: SCAN_RANGE_M/Z 100-1000

PK$SPLASH: splash10-000i-0009000000-91fd6fc72a438efe5744
PK$NUM_PEAK: 21
PK$PEAK: m/z int. rel.int.
  61.97 10 105
  68.98 3 34
  79.94 2 23
  96.95 5 53
  183.01 2 22
  297.15 3 29
  311.17 11 110
  325.19 14 143
  326.20 3 32
  339.20 9 89
  369.24 4 38
  387.25 100 999
  388.25 28 280
  389.27 44 438
  390.27 12 121
  391.28 2 21
  419.28 4 39
  425.25 2 21
  775.54 4 39
  776.55 2 22
  777.54 3 34